Bug #16798 Updated: Compile failure:`OCI_DURATION_STATEMENT' undeclared (first use in this function)
| From: | makesoft at tera dot com dot br | Date: | Fri, 26 Apr 2002 19:23:50 +0000 |
| Subject: | Bug #16798 Updated: Compile failure:`OCI_DURATION_STATEMENT' undeclared (first use in this function) | ||
| References: | 1 | Groups: | php.bugs |
| Request: | Send a blank email to php-bugs+get-6161@lists.php.net to get a copy of this message | ||
ID: 16798
Updated by: makesoft@tera.com.br
Reported By: makesoft@tera.com.br
-Status: Feedback
+Status: Open
Bug Type: OCI8 related
Operating System: Linux
PHP Version: 4.2.0
New Comment:
.
Previous Comments:
------------------------------------------------------------------------
[2002-04-26 15:12:57] makesoft@terra.com.br
make[3]: Entering directory `/usr/src/php-4.2.0/ext/oci8'
gcc -I. -I/usr/src/php-4.2.0/ext/oci8 -I/usr/src/php-4.2.0/main
-I/usr/src/php-4
.2.0 -I/usr/src/apache_1.3.22/src/include
-I/usr/src/apache_1.3.22/src/os/unix -
I/usr/src/php-4.2.0/Zend -I/usr/src/php-4.2.0/ext/mysql/libmysql
-I/home/oracle/
product/1.0/rdbms/demo -I/usr/src/php-4.2.0/ext/xml/expat
-I/usr/src/php-4.2.0/
TSRM -g -O2 -c oci8.c && touch oci8.lo
oci8.c: In function `zif_ociwritetemporarylob':
oci8.c:3383: `OCI_DURATION_STATEMENT' undeclared (first use in this
function)
oci8.c:3383: (Each undeclared identifier is reported only once
oci8.c:3383: for each function it appears in.)
make[3]: *** [oci8.lo] Error 1
make[3]: Leaving directory `/usr/src/php-4.2.0/ext/oci8'
make[2]: *** [all-recursive] Error 1
make[2]: Leaving directory `/usr/src/php-4.2.0/ext/oci8'
make[1]: *** [all-recursive] Error 1
make[1]: Leaving directory `/usr/src/php-4.2.0/ext'
make: *** [all-recursive] Error 1
------------------------------------------------------------------------
[2002-04-26 11:56:50] sander@php.net
What's your configure line?
In which file and function do you get this error?
------------------------------------------------------------------------
[2002-04-24 19:56:06] sniper@php.net
reclassified.
------------------------------------------------------------------------
[2002-04-24 12:01:36] makesoft@tera.com.br
I can´t compile PHP-4.2.0 with oracle 8.
`OCI_DURATION_STATEMENT' undeclared (first use in this function)
------------------------------------------------------------------------
--
Edit this bug report at http://bugs.php.net/?id=16798&edit=1