#29106 [Opn->Csd]: error making with sqlite
| From: | info at sebastianmendel dot de | Date: | Wed, 14 Jul 2004 06:24:33 +0000 |
| Subject: | #29106 [Opn->Csd]: error making with sqlite | ||
| References: | 1 | Groups: | php.bugs |
| Request: | Send a blank email to php-bugs+get-62190@lists.php.net to get a copy of this message | ||
ID: 29106
User updated by: info at sebastianmendel dot de
Reported By: info at sebastianmendel dot de
-Status: Open
+Status: Closed
Bug Type: Compile Failure
Operating System: Fedora Core 2 dev
PHP Version: 5CVS-2004-07-12 (dev)
New Comment:
works in 5CVS-2004-07-13 (dev)
Previous Comments:
------------------------------------------------------------------------
[2004-07-12 12:27:25] info at sebastianmendel dot de
Description:
------------
doing:
$ cd /usr/src
$ cvs -d :pserver:cvsread@cvs.php.net:/repository co php-src
$ cd /usr/src/php-src
$ ./buildconf --force
$ './configure' 'i386-fedora-linux' '--prefix=/usr'
'--exec-prefix=/usr' '--bindir=/usr/bin' '--sbindir=/usr/sbin'
'--libexecdir=/usr/libexec' '--datadir=/usr/share' '--sysconfdir=/etc'
'--sharedstatedir=/usr/com' '--localstatedir=/var' '--libdir=/usr/lib'
'--includedir=/usr/include' '--infodir=/usr/share/info'
'--mandir=/usr/share/man' '--with-apxs2=/usr/sbin/apxs'
'--enable-debug' '--with-layout=GNU' '--with-config-file-path=/etc'
'--enable-safe-mode' '--with-exec-dir=/usr/bin' '--with-zlib'
'--enable-bcmath' '--with-bz2' '--enable-calendar'
'--enable-dba'
'--enable-exif' '--enable-ftp' '--with-gd' '--with-jpeg-dir'
'--with-png-dir' '--with-zlib-dir' '--with-ttf'
'--with-freetype-dir'
'--enable-gd-native-ttf' '--enable-mbstring' '--with-mime-magic'
'--enable-shmop' '--enable-soap' '--enable-sockets'
'--enable-sysvmsg'
'--enable-sysvsem' '--enable-sysvshm' '--enable-memory-limit'
'--enable-zend-multibyte' '--with-mysql=/usr,shared'
'--with-mysqli=shared' '--with-mysql-sock=/var/lib/mysql/mysql.sock'
'--with-xpm-dir=/usr/X11R6/lib'
$ make
...
gcc -I/usr/src/php-src/ext/sqlite/libsqlite/src -Iext/sqlite/
-I/usr/src/php-src/ext/sqlite/ -DPHP_ATOM_INC
-I/usr/src/php-src/include -I/usr/src/php-src/main -I/usr/src/php-src
-I/usr/src/php-src/Zend -I/usr/include/libxml2 -I/usr/X11R6/include
-I/usr/include/freetype2 -I/usr/src/php-src/ext/mbstring/oniguruma
-I/usr/src/php-src/ext/mbstring/libmbfl
-I/usr/src/php-src/ext/mbstring/libmbfl/mbfl -I/usr/include/mysql
-I/usr/src/php-src/TSRM -g -Wall -c
/usr/src/php-src/ext/sqlite/libsqlite/src/opcodes.c -fPIC -DPIC -DPIC
-o ext/sqlite/libsqlite/src/opcodes.o
mv -f ext/sqlite/libsqlite/src/opcodes.o
ext/sqlite/libsqlite/src/opcodes.lo
bison -y /usr/src/php-src/ext/sqlite/libsqlite/src/parse.y
/usr/src/php-src/ext/sqlite/libsqlite/src/parse.y:19.1-13: invalid
directive: `%token_prefix'
/usr/src/php-src/ext/sqlite/libsqlite/src/parse.y:19.15-17: syntax
error, unexpected "identifier"
make: *** [/usr/src/php-src/ext/sqlite/libsqlite/src/parse.c] Error 1
------------------------------------------------------------------------
--
Edit this bug report at http://bugs.php.net/?id=29106&edit=1