#10036 [Com]: dies on make

From: Date: Tue, 20 Jul 2004 14:59:04 +0000
Subject: #10036 [Com]: dies on make
References: 1  Groups: php.bugs 
Request: Send a blank email to php-bugs+get-62732@lists.php.net to get a copy of this message
ID: 10036 Comment by: chat-teen1257 at hotmail dot com Reported By: jjratelle at yahoo dot com Status: Bogus Bug Type: Compile Failure Operating System: solaris 8 PHP Version: 4.0.4pl1 New Comment: <a href=http://vmidgets-infantilis.da.ru>chat teen</a> Previous Comments: ------------------------------------------------------------------------ [2001-03-29 11:30:59] sniper@php.net No bug in PHP. Either your PATH misses the place where ar is located or you don't have it at all in your system. Ask further support questions on php-install@lists.php.net --Jani ------------------------------------------------------------------------ [2001-03-28 10:24:34] jjratelle at yahoo dot com run make (after ./configure) & receive the following: # make Making all in Zend make[1]: Entering directory `/usr/local/src/php-4.0.4pl1/Zend' /bin/sh ../libtool --silent --mode=link gcc -g -O2 -o libZend_c.la zend_lang uage_scanner.lo zend_ini_scanner.lo ../libtool: ar: not found make[1]: *** [libZend_c.la] Error 1 make[1]: Leaving directory `/usr/local/src/php-4.0.4pl1/Zend' make: *** [all-recursive] Error 1 # make install Making install in Zend make[1]: Entering directory `/usr/local/src/php-4.0.4pl1/Zend' /bin/sh ../libtool --silent --mode=link gcc -g -O2 -o libZend_c.la zend_lang uage_scanner.lo zend_ini_scanner.lo ../libtool: ar: not found make[1]: *** [libZend_c.la] Error 1 make[1]: Leaving directory `/usr/local/src/php-4.0.4pl1/Zend' make: *** [install-recursive] Error 1 I've seen one thread similar to this, with instructions to install all development patches for RH. What should be done for sun? Thanks, JohnR ------------------------------------------------------------------------ -- Edit this bug report at http://bugs.php.net/?id=10036&edit=1

« previous php.bugs (#62732) next »