#30637 [Opn->Fbk]: compile with pear error

From: Date: Sun, 31 Oct 2004 23:51:34 +0000
Subject: #30637 [Opn->Fbk]: compile with pear error
References: 1  Groups: php.bugs 
Request: Send a blank email to php-bugs+get-68541@lists.php.net to get a copy of this message
ID: 30637 Updated by: derick@php.net Reported By: arthur at mir5 dot homeip dot net -Status: Open +Status: Feedback Bug Type: Compile Failure Operating System: (Slackware) linux-2.4.25 PHP Version: 5.0.2 New Comment: Thank you for this bug report. To properly diagnose the problem, we need a backtrace to see what is happening behind the scenes. To find out how to generate a backtrace, please read http://bugs.php.net/bugs-generating-backtrace.php Once you have generated a backtrace, please submit it to this bug report and change the status back to "Open". Thank you for helping us make PHP better. Previous Comments: ------------------------------------------------------------------------ [2004-11-01 00:40:34] arthur at mir5 dot homeip dot net Description: ------------ gcc version 3.2.3 GNU Make 3.80 ./configure --with-apxs2=/var/lib/apache2/bin/apxs --disable-ipv6 --with-openssl --with-pgsql make ... ... Build complete. make install and the error occurs. No error when i add --without-pear Reproduce code: --------------- make install Installing PHP SAPI module: apache2handler /var/lib/apache2/build/instdso.sh SH_LIBTOOL='/var/lib/apache2/build/libtool' libphp5.la /var/lib/apache2/modules /var/lib/apache2/build/libtool --mode=install cp libphp5.la /var/lib/apache2/modules/ cp .libs/libphp5.so /var/lib/apache2/modules/libphp5.so cp .libs/libphp5.lai /var/lib/apache2/modules/libphp5.la libtool: install: warning: remember to run `libtool --finish /usr/local/php-5.0.2/libs' chmod 755 /var/lib/apache2/modules/libphp5.so [activating module `php5' in /var/lib/apache2/conf/httpd.conf] Installing PHP CLI binary: /usr/local/bin/ Installing PHP CLI man page: /usr/local/man/man1/ Installing PEAR environment: /usr/local/lib/php/ make[1]: *** [install-pear-installer] Segmentation fault make: *** [install-pear] Error 2 Expected result: ---------------- Something is wrong with the make scripts. Actual result: -------------- make[1]: *** [install-pear-installer] Segmentation fault make: *** [install-pear] Error 2 ------------------------------------------------------------------------ -- Edit this bug report at http://bugs.php.net/?id=30637&edit=1

« previous php.bugs (#68541) next »