#30641 [Opn]: Compile error: error: symbol "zend_error" is used but not defined

From: Date: Wed, 10 Nov 2004 06:03:19 +0000
Subject: #30641 [Opn]: Compile error: error: symbol "zend_error" is used but not defined
References: 1  Groups: php.bugs 
Request: Send a blank email to php-bugs+get-68879@lists.php.net to get a copy of this message
ID: 30641 Updated by: dmitry@php.net Reported By: hakan at lisas dot de Status: Open Bug Type: Compile Failure Operating System: Solaris 9 PHP Version: 5CVS-2004-11-01 (dev) New Comment: Can you please provide information about versions of your GCC and AS? Previous Comments: ------------------------------------------------------------------------ [2004-11-01 04:50:37] hakan at lisas dot de Description: ------------ Compile of latest HEAD fails with: /bin/sh /usr/local/php-src/libtool --silent --preserve-dup-deps --mode=compile gcc -IZend/ -I/usr/local/php-src/Zend/ -DPHP_ATOM_INC -I/usr/local/php-src/include -I/usr/local/php-src/main -I/usr/local/php-src -I/usr/local/php-src/Zend -I/usr/local/include/libxml2 -I/usr/local/include -I/usr/local/include/freetype2 -I/usr/local/mysql/include/mysql -I/usr/local/pgsql/include -D_POSIX_PTHREAD_SEMANTICS -I/usr/local/php-src/TSRM -g -O2 -prefer-pic -c /usr/local/php-src/Zend/zend_execute.c -o Zend/zend_execute.lo /usr/ccs/bin/as: "/var/tmp//ccOlcxja.s": error: symbol "zend_error" is used but not defined /usr/ccs/bin/as: "/var/tmp//ccOlcxja.s": internal error: evaluate_symbol_expression(): op 20? make: *** [Zend/zend_execute.lo] Error 1 ------------------------------------------------------------------------ -- Edit this bug report at http://bugs.php.net/?id=30641&edit=1

« previous php.bugs (#68879) next »