#32580 [Opn->Bgs]: CVS PHP 5.1.x Compile error on Solaris 9
| From: | sniper@php.net | Date: | Tue, 05 Apr 2005 07:25:25 +0000 |
| Subject: | #32580 [Opn->Bgs]: CVS PHP 5.1.x Compile error on Solaris 9 | ||
| References: | 1 | Groups: | php.bugs |
| Request: | Send a blank email to php-bugs+get-76355@lists.php.net to get a copy of this message | ||
ID: 32580
Updated by: sniper@php.net
Reported By: Oscar dot Castillo at jpl dot nasa dot gov
-Status: Open
+Status: Bogus
Bug Type: Compile Failure
Operating System: solaris 9
PHP Version: 5CVS-2005-04-05 (dev)
New Comment:
Please do not submit the same bug more than once. An existing
bug report already describes this very problem. Even if you feel
that your issue is somewhat different, the resolution is likely
to be the same.
Thank you for your interest in PHP.
See bug #30641
Previous Comments:
------------------------------------------------------------------------
[2005-04-05 03:34:43] Oscar dot Castillo at jpl dot nasa dot gov
Description:
------------
I downloaded the latest CVS php5-200504041830 (as suggested in bug
#32491) and have failed to compile correctly. The configure options I
use are as follows:
./configure --prefix=/usr/local/php
--with-nsapi=/usr/ns-home/operational_server
This is the compile error I receive:
/bin/sh /usr/local/src/php_src/php5-200504041830/libtool --silent
--preserve-dup-deps --mode=compile
/usr/local/src/php_src/php5-200504041830/meta_ccld -IZend/
-I/usr/local/src/php_src/php5-200504041830/Zend/ -DPHP_ATOM_INC
-I/usr/local/src/php_src/php5-200504041830/include
-I/usr/local/src/php_src/php5-200504041830/main
-I/usr/local/src/php_src/php5-200504041830
-I/usr/ns-home/operational_server/plugins/include
-I/usr/local/include/libxml2 -I/usr/local/include
-I/usr/local/src/php_src/php5-200504041830/TSRM
-I/usr/local/src/php_src/php5-200504041830/Zend
-D_POSIX_PTHREAD_SEMANTICS -D_POSIX_PTHREAD_SEMANTICS -D_REENTRANT -g
-O2 -pthreads -DZTS -c
/usr/local/src/php_src/php5-200504041830/Zend/zend_execute.c -o
Zend/zend_execute.lo -O0
/usr/ccs/bin/as: "/tmp/ccA7i1xh.s": error: symbol "zend_error" is used
but not defined
/usr/ccs/bin/as: "/tmp/ccA7i1xh.s": internal error:
evaluate_symbol_expression(): op 20?
make: *** [Zend/zend_execute.lo] Error 1
Thanks in advance for your help.
Reproduce code:
---------------
./configure --prefix=/usr/local/php
--with-nsapi=/usr/ns-home/operational_server
Expected result:
----------------
Successfull compilation of the latest CVS version of PHP 5
Actual result:
--------------
/bin/sh /usr/local/src/php_src/php5-200504041830/libtool --silent
--preserve-dup-deps --mode=compile
/usr/local/src/php_src/php5-200504041830/meta_ccld -IZend/
-I/usr/local/src/php_src/php5-200504041830/Zend/ -DPHP_ATOM_INC
-I/usr/local/src/php_src/php5-200504041830/include
-I/usr/local/src/php_src/php5-200504041830/main
-I/usr/local/src/php_src/php5-200504041830
-I/usr/ns-home/operational_server/plugins/include
-I/usr/local/include/libxml2 -I/usr/local/include
-I/usr/local/src/php_src/php5-200504041830/TSRM
-I/usr/local/src/php_src/php5-200504041830/Zend
-D_POSIX_PTHREAD_SEMANTICS -D_POSIX_PTHREAD_SEMANTICS -D_REENTRANT -g
-O2 -pthreads -DZTS -c
/usr/local/src/php_src/php5-200504041830/Zend/zend_execute.c -o
Zend/zend_execute.lo -O0
/usr/ccs/bin/as: "/tmp/ccA7i1xh.s": error: symbol "zend_error" is used
but not defined
/usr/ccs/bin/as: "/tmp/ccA7i1xh.s": internal error:
evaluate_symbol_expression(): op 20?
make: *** [Zend/zend_execute.lo] Error 1
------------------------------------------------------------------------
--
Edit this bug report at http://bugs.php.net/?id=32580&edit=1