#32795 [Opn]: Compile errors in:pdo_stmt.c, php_pdo_int.h

From: Date: Thu, 21 Apr 2005 21:44:42 +0000
Subject: #32795 [Opn]: Compile errors in:pdo_stmt.c, php_pdo_int.h
References: 1  Groups: php.bugs 
Request: Send a blank email to php-bugs+get-78030@lists.php.net to get a copy of this message
ID: 32795 User updated by: JClawson at tamu dot edu Reported By: JClawson at tamu dot edu Status: Open Bug Type: Compile Failure Operating System: Fedora Core 2 PHP Version: 5CVS-2005-04-21 (dev) New Comment: gcc (GCC) 4.0.0 20050412 (Red Hat 4.0.0-0.42) Previous Comments: ------------------------------------------------------------------------ [2005-04-21 23:42:37] JClawson at tamu dot edu Description: ------------ /home/upgrade-tmp/php5-200504212030/ext/pdo/pdo_stmt.c: In function 'do_fetch': /home/upgrade-tmp/php5-200504212030/ext/pdo/pdo_stmt.c:876: warning: pointer targets in passing ar gument 3 of 'ce->unserialize' differ in signedness /home/upgrade-tmp/php5-200504212030/ext/pdo/pdo_stmt.c: At top level: /home/upgrade-tmp/php5-200504212030/ext/pdo/pdo_stmt.c:1749: error: static declaration of 'pdo_dbs tmt_object_handlers' follows non-static declaration /home/upgrade-tmp/php5-200504212030/ext/pdo/php_pdo_int.h:41: error: previous declaration of 'pdo_ dbstmt_object_handlers' was here /home/upgrade-tmp/php5-200504212030/ext/pdo/pdo_stmt.c:2115: error: static declaration of 'pdo_row _object_handlers' follows non-static declaration /home/upgrade-tmp/php5-200504212030/ext/pdo/php_pdo_int.h:49: error: previous declaration of 'pdo_ row_object_handlers' was here make: *** [ext/pdo/pdo_stmt.lo] Error 1 ------------------------------------------------------------------------ -- Edit this bug report at http://bugs.php.net/?id=32795&edit=1

« previous php.bugs (#78030) next »