Bug #17327: Compile works with 4.2.0 but not for 4.2.1

From: Date: Tue, 21 May 2002 04:37:54 +0000
Subject: Bug #17327: Compile works with 4.2.0 but not for 4.2.1
Groups: php.bugs 
Request: Send a blank email to php-bugs+get-8058@lists.php.net to get a copy of this message
From: larry@velella.org Operating system: Solaris 8 PHP version: 4.2.1 PHP Bug Type: Compile Failure Bug description: Compile works with 4.2.0 but not for 4.2.1 pacific 53 # uname -a SunOS pacific 5.8 Generic_108528-13 sun4u sparc SUNW,Ultra-5 pacific 54 # make Making all in Zend make[1]: Entering directory `/usr/local/src/php-4.2.1/Zend' make[1]: Nothing to be done for `all'. make[1]: Leaving directory `/usr/local/src/php-4.2.1/Zend' Making all in main make[1]: Entering directory `/usr/local/src/php-4.2.1/main' make[2]: Entering directory `/usr/local/src/php-4.2.1/main' /bin/sh /usr/local/src/php-4.2.1/libtool --silent --mode=compile gcc -I. -I/usr In file included from php.h:34, from internal_functions.c:23: /usr/local/src/php-4.2.1/Zend/zend.h:55:19: unix.h: No such file or directory In file included from internal_functions.c:23: php.h:71:18: unix.h: Error 0 make[2]: *** [internal_functions.lo] Error 1 make[2]: Leaving directory `/usr/local/src/php-4.2.1/main' make[1]: *** [all-recursive] Error 1 make[1]: Leaving directory `/usr/local/src/php-4.2.1/main' make: *** [all-recursive] Error 1 pacific 55 # p -- Edit bug report at http://bugs.php.net/?id=17327&edit=1 -- Fixed in CVS: http://bugs.php.net/fix.php?id=17327&r=fixedcvs Fixed in release: http://bugs.php.net/fix.php?id=17327&r=alreadyfixed Need backtrace: http://bugs.php.net/fix.php?id=17327&r=needtrace Try newer version: http://bugs.php.net/fix.php?id=17327&r=oldversion Not developer issue: http://bugs.php.net/fix.php?id=17327&r=support Expected behavior: http://bugs.php.net/fix.php?id=17327&r=notwrong Not enough info: http://bugs.php.net/fix.php?id=17327&r=notenoughinfo Submitted twice: http://bugs.php.net/fix.php?id=17327&r=submittedtwice register_globals: http://bugs.php.net/fix.php?id=17327&r=globals

« previous php.bugs (#8058) next »