#33398 [Fbk]: Compile failure

From: Date: Sun, 19 Jun 2005 13:05:13 +0000
Subject: #33398 [Fbk]: Compile failure
References: 1  Groups: php.bugs 
Request: Send a blank email to php-bugs+get-80637@lists.php.net to get a copy of this message
ID: 33398 Updated by: nohn@php.net Reported By: nohn@php.net Status: Feedback Bug Type: Compile Failure Operating System: SunOS 5.10 PHP Version: 5.1.0b1 New Comment: It's sparc: $ /usr/sbin/prtdiag System Configuration: Sun Microsystems sun4u Sun Ultra 5/10 UPA/PCI (UltraSPARC-IIi 440MHz) System clock frequency: 110 MHz Memory size: 1024 Megabytes PHP5-stable fails: gcc -I"/usr/include" -Iext/iconv/ -I/home/nohn/php5-STABLE-200506191033/ext/iconv/ -DPHP_ATOM_INC -I/home/nohn/php5-STABLE-200506191033/include -I/home/nohn/php5-STABLE-200506191033/main -I/home/nohn/php5-STABLE-200506191033 -I/usr/include/libxml2 -I/home/nohn/php5-STABLE-200506191033/TSRM -I/home/nohn/php5-STABLE-200506191033/Zend -D_POSIX_PTHREAD_SEMANTICS -g -O2 -c /home/nohn/php5-STABLE-200506191033/ext/iconv/iconv.c -o ext/iconv/iconv.o && echo > ext/iconv/iconv.lo In file included from /usr/include/iso/stdarg_iso.h:41, from /usr/include/stdarg.h:32, from /home/nohn/php5-STABLE-200506191033/Zend/zend.h:76, from /home/nohn/php5-STABLE-200506191033/main/php.h:34, from /home/nohn/php5-STABLE-200506191033/ext/iconv/iconv.c:27: /usr/include/sys/va_impl.h:150: #error ("Unrecognized compiler protocol for variable argument lists") make: *** [ext/iconv/iconv.lo] Error 1 PHP4-stable-latest compiles fine; make test works Previous Comments: ------------------------------------------------------------------------ [2005-06-19 14:19:32] sniper@php.net And what platform is it? Sparc or x86? ------------------------------------------------------------------------ [2005-06-19 14:18:10] sniper@php.net Do these compile: http://snaps.php.net/php5-STABLE-latest.tar.gz http://snaps.php.net/php4-STABLE-latest.tar.gz ?? ------------------------------------------------------------------------ [2005-06-19 14:12:39] nohn@php.net The problem persits: /bin/sh /home/nohn/php5-200506191030/libtool --silent --preserve-dup-deps --mode=compile gcc -I"/usr/include" -Iext/iconv/ -I/home/nohn/php5-200506191030/ext/iconv/ -DPHP_ATOM_INC -I/home/nohn/php5-200506191030/include -I/home/nohn/php5-200506191030/main -I/home/nohn/php5-200506191030 -I/usr/include/libxml2 -I/home/nohn/php5-200506191030/TSRM -I/home/nohn/php5-200506191030/Zend -D_POSIX_PTHREAD_SEMANTICS -g -O2 -c /home/nohn/php5-200506191030/ext/iconv/iconv.c -o ext/iconv/iconv.lo In file included from /usr/include/iso/stdarg_iso.h:41, from /usr/include/stdarg.h:32, from /home/nohn/php5-200506191030/Zend/zend.h:76, from /home/nohn/php5-200506191030/main/php.h:34, from /home/nohn/php5-200506191030/ext/iconv/iconv.c:27: /usr/include/sys/va_impl.h:150: #error ("Unrecognized compiler protocol for variable argument lists") make: *** [ext/iconv/iconv.lo] Error 1 ------------------------------------------------------------------------ [2005-06-19 13:42:13] sniper@php.net Please try using this CVS snapshot: http://snaps.php.net/php5-latest.tar.gz For Windows: http://snaps.php.net/win32/php5-win32-latest.zip ------------------------------------------------------------------------ [2005-06-19 13:36:45] nohn@php.net Description: ------------ Compilation of PHP 5.1.0b1 fails on SunOS 5.10, gcc version 2.95.3 20010315 (release) Reproduce code: --------------- ./configure; make Expected result: ---------------- PHP gets built Actual result: -------------- /bin/sh /home/nohn/php-5.1.0b1/libtool --silent --preserve-dup-deps --mode=compile gcc -I"/usr/include" -Iext/iconv/ -I/home/nohn/php-5.1.0b1/ext/iconv/ -DPHP_ATOM_INC -I/home/nohn/php-5.1.0b1/include -I/home/nohn/php-5.1.0b1/main -I/home/nohn/php-5.1.0b1 -I/usr/include/libxml2 -I/home/nohn/php-5.1.0b1/TSRM -I/home/nohn/php-5.1.0b1/Zend -D_POSIX_PTHREAD_SEMANTICS -g -O2 -c /home/nohn/php-5.1.0b1/ext/iconv/iconv.c -o ext/iconv/iconv.lo In file included from /usr/include/iso/stdarg_iso.h:41, from /usr/include/stdarg.h:32, from /home/nohn/php-5.1.0b1/Zend/zend.h:76, from /home/nohn/php-5.1.0b1/main/php.h:34, from /home/nohn/php-5.1.0b1/ext/iconv/iconv.c:27: /usr/include/sys/va_impl.h:150: #error ("Unrecognized compiler protocol for variable argument lists") make: *** [ext/iconv/iconv.lo] Error 1 ------------------------------------------------------------------------ -- Edit this bug report at http://bugs.php.net/?id=33398&edit=1

« previous php.bugs (#80637) next »