#34636 [NEW]: collect2: ld returned 1 exit status make: *** [sapi/cli/php] Error 1
| From: | webmaster at sunshinearcade dot com | Date: | Sun, 25 Sep 2005 23:26:46 +0000 |
| Subject: | #34636 [NEW]: collect2: ld returned 1 exit status make: *** [sapi/cli/php] Error 1 | ||
| Groups: | php.bugs | ||
| Request: | Send a blank email to php-bugs+get-85566@lists.php.net to get a copy of this message | ||
From: webmaster at sunshinearcade dot com
Operating system: Fedora Core 3
PHP version: 5.0.5
PHP Bug Type: Compile Failure
Bug description: collect2: ld returned 1 exit status
make: *** [sapi/cli/php] Error 1
Description:
------------
make and make install produce error stating ld could not find lgcrypt
PHP 5.0.5
Fedora Core 3
Apache 2.0.54
MySQL 4.1.14
Reproduce code:
---------------
./configure --with-apxs2=/usr/local/apache2/bin/apxs
--with-mysqli=/usr/local/mysql/bin --with-xsl=/usr/lib
Actual result:
--------------
Zend/zend_execute.lo sapi/cli/php_cli.lo sapi/cli/getopt.lo
main/internal_functions_cli.lo -lcrypt -lexslt -lcrypt -lresolv -lm -ldl
-lnsl -lxml2 -lz -lm -lxml2 -lz -lm -lmysqlclient -lz -lcrypt -lnsl -lm
-lxml2 -lz -lm -lcrypt -lxml2 -lz -lm -lxslt -lxml2 -lz -lm -lcrypt -o
sapi/cli/php
/usr/bin/ld: cannot find -lgcrypt
collect2: ld returned 1 exit status
make: *** [sapi/cli/php] Error 1
--
Edit bug report at http://bugs.php.net/?id=34636&edit=1
--
Try a CVS snapshot (php4): http://bugs.php.net/fix.php?id=34636&r=trysnapshot4
Try a CVS snapshot (php5.0): http://bugs.php.net/fix.php?id=34636&r=trysnapshot50
Try a CVS snapshot (php5.1): http://bugs.php.net/fix.php?id=34636&r=trysnapshot51
Fixed in CVS: http://bugs.php.net/fix.php?id=34636&r=fixedcvs
Fixed in release: http://bugs.php.net/fix.php?id=34636&r=alreadyfixed
Need backtrace: http://bugs.php.net/fix.php?id=34636&r=needtrace
Need Reproduce Script: http://bugs.php.net/fix.php?id=34636&r=needscript
Try newer version: http://bugs.php.net/fix.php?id=34636&r=oldversion
Not developer issue: http://bugs.php.net/fix.php?id=34636&r=support
Expected behavior: http://bugs.php.net/fix.php?id=34636&r=notwrong
Not enough info: http://bugs.php.net/fix.php?id=34636&r=notenoughinfo
Submitted twice: http://bugs.php.net/fix.php?id=34636&r=submittedtwice
register_globals: http://bugs.php.net/fix.php?id=34636&r=globals
PHP 3 support discontinued: http://bugs.php.net/fix.php?id=34636&r=php3
Daylight Savings: http://bugs.php.net/fix.php?id=34636&r=dst
IIS Stability: http://bugs.php.net/fix.php?id=34636&r=isapi
Install GNU Sed: http://bugs.php.net/fix.php?id=34636&r=gnused
Floating point limitations: http://bugs.php.net/fix.php?id=34636&r=float
No Zend Extensions: http://bugs.php.net/fix.php?id=34636&r=nozend
MySQL Configuration Error: http://bugs.php.net/fix.php?id=34636&r=mysqlcfg