#34688 [NEW]: php 4.4.0 compile failure: make: *** [libs/libphp4.bundle] Error 1

From: Date: Fri, 30 Sep 2005 09:01:43 +0000
Subject: #34688 [NEW]: php 4.4.0 compile failure: make: *** [libs/libphp4.bundle] Error 1
Groups: php.bugs 
Request: Send a blank email to php-bugs+get-85797@lists.php.net to get a copy of this message
From: justin at mind-productions dot com Operating system: Mac os X 10.4.2 PHP version: 4.4.0 PHP Bug Type: Compile Failure Bug description: php 4.4.0 compile failure: make: *** [libs/libphp4.bundle] Error 1 Description: ------------ When running "make" in the terminal I get this error: /usr/bin/ld: unknown flag: -export-symbols collect2: ld returned 1 exit status make: *** [libs/libphp4.bundle] Error 1 This is what I used to configure: './configure' '--prefix=/Library/PHP4' '--with-apxs2=/ Library/Apache2/bin/apxs' '--with-openssl=/usr' '--with- zlib=/usr' '--enable-calendar' '--enable-shared' '--enable- exif' '--enable-ftp' '--enable-mbstring' '--enable-mbregex' '--enable-sockets' '--enable-wddx' '--enable-yp' '--enable- versioning' '--with-mysql=/Library/PHP4' '--with-ldap=/usr' '--with-iodbc=/Library/PHP4' '--with-jpeg-dir=/Library/PHP4' '--with-png-dir=/Library/PHP4' '--enable-xslt' '--with- pdflib=/Library/PHP4' '--with-tiff-dir=/Library/PHP4' '-- with-pgsql=/Library/PHP4' '--with-sybase=/Library/PHP4' '-- with-mcrypt=/Library/PHP4' '--with-curl=/usr' '--with-ttf=/ Library/PHP4' '--with-gettext=/Library/PHP4' '--with-xmlrpc' '--with-mime-magic' '--with-pspell=/Library/PHP4' '--with- expat-dir=/Library/Apache2' '--with-t1lib=/Library/PHP4' '-- enable-dbx' '--with-imap=/Library/PHP4' '--with-imap-ssl=/ usr' '--enable-dbase' '--with-bz2=/usr' '--with-dom=/ Library/PHP4' '--with-dom-xslt=/Library/PHP4' '--with-dom- exslt=/Library/PHP4' '--with-xslt-sablot=/Library/PHP4' '-- with-snmp=/Library/PHP4' '--enable-ucd-snmp-hack' '--with- mhash=/Library/PHP4' '--with-ming=/Library/PHP4' '--enable- shmop' '--with-gmp=/Library/PHP4' '--enable-dio' '--enable- bcmath' '--enable-dba' '--enable-gd-native-ttf' '--with- zip=/Library/PHP4' '--with-magickwand=/usr' Reproduce code: --------------- './configure' '--prefix=/Library/PHP4' '--with-apxs2=/Library/Apache2/bin/apxs' '--with-openssl=/usr' '--with-zlib=/usr' '--enable-calendar' '--enable-shared' '--enable-exif' '--enable-ftp' '--enable-mbstring' '--enable-mbregex' '--enable-sockets' '--enable-wddx' '--enable-yp' '--enable-versioning' '--with-mysql=/Library/PHP4' '--with-ldap=/usr' '--with-iodbc=/Library/PHP4' '--with-jpeg-dir=/Library/PHP4' '--with-png-dir=/Library/PHP4' '--enable-xslt' '--with-pdflib=/Library/PHP4' '--with-tiff-dir=/Library/PHP4' '--with-pgsql=/Library/PHP4' '--with-sybase=/Library/PHP4' '--with-mcrypt=/Library/PHP4' '--with-curl=/usr' '--with-ttf=/Library/PHP4' '--with-gettext=/Library/PHP4' '--with-xmlrpc' '--with-mime-magic' '--with-pspell=/Library/PHP4' '--with-expat-dir=/Library/Apache2' '--with-t1lib=/Library/PHP4' '--enable-dbx' '--with-imap=/Library/PHP4' '--with-imap-ssl=/usr' '--enable-dbase' '--with-bz2=/usr' '--with-dom=/Library/PHP4' '--with-dom-xslt=/Library/PHP4' '--with-dom-exslt=/Library/PHP4' '--with-xslt-sablot=/Library/PHP4' '--with-snmp=/Library/PHP4' '--enable-ucd-snmp-hack' '--with-mhash=/Library/PHP4' '--with-ming=/Library/PHP4' '--enable-shmop' '--with-gmp=/Library/PHP4' '--enable-dio' '--enable-bcmath' '--enable-dba' '--enable-gd-native-ttf' '--with-zip=/Library/PHP4' '--with-magickwand=/usr' make Expected result: ---------------- it should run and compile php -- Edit bug report at http://bugs.php.net/?id=34688&edit=1 -- Try a CVS snapshot (php4): http://bugs.php.net/fix.php?id=34688&r=trysnapshot4 Try a CVS snapshot (php5.0): http://bugs.php.net/fix.php?id=34688&r=trysnapshot50 Try a CVS snapshot (php5.1): http://bugs.php.net/fix.php?id=34688&r=trysnapshot51 Fixed in CVS: http://bugs.php.net/fix.php?id=34688&r=fixedcvs Fixed in release: http://bugs.php.net/fix.php?id=34688&r=alreadyfixed Need backtrace: http://bugs.php.net/fix.php?id=34688&r=needtrace Need Reproduce Script: http://bugs.php.net/fix.php?id=34688&r=needscript Try newer version: http://bugs.php.net/fix.php?id=34688&r=oldversion Not developer issue: http://bugs.php.net/fix.php?id=34688&r=support Expected behavior: http://bugs.php.net/fix.php?id=34688&r=notwrong Not enough info: http://bugs.php.net/fix.php?id=34688&r=notenoughinfo Submitted twice: http://bugs.php.net/fix.php?id=34688&r=submittedtwice register_globals: http://bugs.php.net/fix.php?id=34688&r=globals PHP 3 support discontinued: http://bugs.php.net/fix.php?id=34688&r=php3 Daylight Savings: http://bugs.php.net/fix.php?id=34688&r=dst IIS Stability: http://bugs.php.net/fix.php?id=34688&r=isapi Install GNU Sed: http://bugs.php.net/fix.php?id=34688&r=gnused Floating point limitations: http://bugs.php.net/fix.php?id=34688&r=float No Zend Extensions: http://bugs.php.net/fix.php?id=34688&r=nozend MySQL Configuration Error: http://bugs.php.net/fix.php?id=34688&r=mysqlcfg

« previous php.bugs (#85797) next »