#37051 [NEW]: Clean Checkout of PHP5CVS does not compile

From: Date: Wed, 12 Apr 2006 09:50:45 +0000
Subject: #37051 [NEW]: Clean Checkout of PHP5CVS does not compile
Groups: php.bugs 
Request: Send a blank email to php-bugs+get-95653@lists.php.net to get a copy of this message
From: nohn@php.net Operating system: Linux, FC4 PHP version: 5CVS-2006-04-12 (CVS) PHP Bug Type: Compile Failure Bug description: Clean Checkout of PHP5CVS does not compile Description: ------------ A clean CVS checkout of PHP_5_1 does not compile: /bin/sh /home/cruise/projects/PHP_5_1/php5/libtool --silent --preserve-dup-deps --mode=compile gcc -Iext/standard/ -I/home/cruise/projects/PHP_5_1/php5/ext/sta ndard/ -DPHP_ATOM_INC -I/home/cruise/projects/PHP_5_1/php5/include -I/home/cruis e/projects/PHP_5_1/php5/main -I/home/cruise/projects/PHP_5_1/php5 -I/usr/include /libxml2 -I/home/cruise/projects/PHP_5_1/php5/ext/date/lib -I/home/cruise/projec ts/PHP_5_1/php5/TSRM -I/home/cruise/projects/PHP_5_1/php5/Zend -I/usr/include -g -O2 -c /home/cruise/projects/PHP_5_1/php5/ext/standard/basic_functions.c -o ext/standard/basic_functions.lo /home/cruise/projects/PHP_5_1/php5/ext/standard/basic_functions.c:45:34: error: zend_language_parser.h: No such file or directory make: *** [ext/standard/basic_functions.lo] Error 1 Reproduce code: --------------- cvs -d :pserver:cvsread@cvs.php.net:/repository checkout -r PHP_5_1 php5 ./buildconf --force ./configure --prefix=/home/cruise/projects/PHP_5_1/slash/opt/php/ --sysconfdir=/home/cruise/projects/PHP_5_1/slash/etc/opt/php --sharedstatedir=/home/cruise/projects/PHP_5_1/slash/var/opt/php --disable-cgi --enable-cli make Expected result: ---------------- compiles fine Actual result: -------------- /bin/sh /home/cruise/projects/PHP_5_1/php5/libtool --silent --preserve-dup-deps --mode=compile gcc -Iext/standard/ -I/home/cruise/projects/PHP_5_1/php5/ext/sta ndard/ -DPHP_ATOM_INC -I/home/cruise/projects/PHP_5_1/php5/include -I/home/cruis e/projects/PHP_5_1/php5/main -I/home/cruise/projects/PHP_5_1/php5 -I/usr/include /libxml2 -I/home/cruise/projects/PHP_5_1/php5/ext/date/lib -I/home/cruise/projec ts/PHP_5_1/php5/TSRM -I/home/cruise/projects/PHP_5_1/php5/Zend -I/usr/include -g -O2 -c /home/cruise/projects/PHP_5_1/php5/ext/standard/basic_functions.c -o ext/standard/basic_functions.lo /home/cruise/projects/PHP_5_1/php5/ext/standard/basic_functions.c:45:34: error: zend_language_parser.h: No such file or directory make: *** [ext/standard/basic_functions.lo] Error 1 -- Edit bug report at http://bugs.php.net/?id=37051&edit=1 -- Try a CVS snapshot (PHP 4.4): http://bugs.php.net/fix.php?id=37051&r=trysnapshot44 Try a CVS snapshot (PHP 5.1): http://bugs.php.net/fix.php?id=37051&r=trysnapshot51 Try a CVS snapshot (PHP 6.0): http://bugs.php.net/fix.php?id=37051&r=trysnapshot60 Fixed in CVS: http://bugs.php.net/fix.php?id=37051&r=fixedcvs Fixed in release: http://bugs.php.net/fix.php?id=37051&r=alreadyfixed Need backtrace: http://bugs.php.net/fix.php?id=37051&r=needtrace Need Reproduce Script: http://bugs.php.net/fix.php?id=37051&r=needscript Try newer version: http://bugs.php.net/fix.php?id=37051&r=oldversion Not developer issue: http://bugs.php.net/fix.php?id=37051&r=support Expected behavior: http://bugs.php.net/fix.php?id=37051&r=notwrong Not enough info: http://bugs.php.net/fix.php?id=37051&r=notenoughinfo Submitted twice: http://bugs.php.net/fix.php?id=37051&r=submittedtwice register_globals: http://bugs.php.net/fix.php?id=37051&r=globals PHP 3 support discontinued: http://bugs.php.net/fix.php?id=37051&r=php3 Daylight Savings: http://bugs.php.net/fix.php?id=37051&r=dst IIS Stability: http://bugs.php.net/fix.php?id=37051&r=isapi Install GNU Sed: http://bugs.php.net/fix.php?id=37051&r=gnused Floating point limitations: http://bugs.php.net/fix.php?id=37051&r=float No Zend Extensions: http://bugs.php.net/fix.php?id=37051&r=nozend MySQL Configuration Error: http://bugs.php.net/fix.php?id=37051&r=mysqlcfg

« previous php.bugs (#95653) next »