Re: php4/oci8 - compiling error - TOP URGENT

From: Date: Mon, 28 Aug 2000 14:47:39 +0000
Subject: Re: php4/oci8 - compiling error - TOP URGENT
References: 1  Groups: php.db 
Request: Send a blank email to php-db+get-2416@lists.php.net to get a copy of this message
On Mon, Aug 28, 2000 at 11:37:30AM -0300, Joao Alves wrote: > Hi there > > I've got a problem when I tried to compile php4 with oci8. pls see below > ther error. > Ps: the oracle is work properly. please send me you network/public/orl.h off-list. tc > > Thanks in advanced > > Joao Alves > > ---------------------------------------------------------------------------- > > /bin/sh /home/ftp/incoming/php-4.0.1pl2/libtool --silent --mode=compile > gcc -DHAVE_CONFIG_H -I. -I/home/ftp/incoming/php-4.0.1pl2/main -I/home/ftp/i > ncoming/php-4.0.1pl2 -I/home/ftp/incoming/php-4.0.1pl2/main -I/usr/include/a > pache -I/home/ftp/incoming/php-4.0.1pl2/Zend -I/home/ftp/incoming/php-4.0.1p > l2 -I/home/ftp/incoming/php-4.0.1pl2/ext/mysql/libmysql -I/home/oracle/app/o > racle/product/8.0.5/rdbms/demo -I/home/oracle/app/oracle/product/8.0.5/netwo > rk/public -I/home/oracle/app/oracle/product/8.0.5/plsql/public -I/home/ftp/i > ncoming/php-4.0.1pl2/ext/xml/expat/xmltok -I/home/ftp/incoming/php-4.0.1pl2/ > ext/xml/expat/xmlparse -DEAPI=1 -DXML_BYTE_ORDER=12 -g -O2 -c > internal_functions.c > In file included from > /home/oracle/app/oracle/product/8.0.5/network/public/oci.h:1552, > from > /home/ftp/incoming/php-4.0.1pl2/ext/oci8/php_oci8.h:56, > from internal_functions.c:39: > /home/oracle/app/oracle/product/8.0.5/network/public/orl.h:1819: parse error > before `{' > /home/oracle/app/oracle/product/8.0.5/network/public/orl.h:1819: stray '\' > in program > /home/oracle/app/oracle/product/8.0.5/network/public/orl.h:1820: stray '\' > in program > /home/oracle/app/oracle/product/8.0.5/network/public/orl.h:1821: `date' > undeclared here (not in a function) > /home/oracle/app/oracle/product/8.0.5/network/public/orl.h:1821: warning: > data definition has no type or storage class > /home/oracle/app/oracle/product/8.0.5/network/public/orl.h:1821: stray '\' > in program > /home/oracle/app/oracle/product/8.0.5/network/public/orl.h:1822: `date' > undeclared here (not in a function) > /home/oracle/app/oracle/product/8.0.5/network/public/orl.h:1822: warning: > data definition has no type or storage class > /home/oracle/app/oracle/product/8.0.5/network/public/orl.h:1822: stray '\' > in program > /home/oracle/app/oracle/product/8.0.5/network/public/orl.h:1823: parse error > before `}' > /home/oracle/app/oracle/product/8.0.5/network/public/orl.h:1842: stray '\' > in program > /home/oracle/app/oracle/product/8.0.5/network/public/orl.h:1843: stray '\' > in program > /home/oracle/app/oracle/product/8.0.5/network/public/orl.h:1844: `date' > undeclared here (not in a function) > /home/oracle/app/oracle/product/8.0.5/network/public/orl.h:1844: warning: > data definition has no type or storage class > /home/oracle/app/oracle/product/8.0.5/network/public/orl.h:1844: stray '\' > in program > /home/oracle/app/oracle/product/8.0.5/network/public/orl.h:1845: `date' > undeclared here (not in a function) > /home/oracle/app/oracle/product/8.0.5/network/public/orl.h:1845: warning: > data definition has no type or storage class > /home/oracle/app/oracle/product/8.0.5/network/public/orl.h:1845: stray '\' > in program > /home/oracle/app/oracle/product/8.0.5/network/public/orl.h:1846: parse error > before `}' > /home/oracle/app/oracle/product/8.0.5/network/public/orl.h:1864: stray '\' > in program > /home/oracle/app/oracle/product/8.0.5/network/public/orl.h:1865: stray '\' > in program > /home/oracle/app/oracle/product/8.0.5/network/public/orl.h:1866: parse error > before `->' > /home/oracle/app/oracle/product/8.0.5/network/public/orl.h:1866: stray '\' > in program > /home/oracle/app/oracle/product/8.0.5/network/public/orl.h:1867: parse error > before `->' > /home/oracle/app/oracle/product/8.0.5/network/public/orl.h:1867: stray '\' > in program > /home/oracle/app/oracle/product/8.0.5/network/public/orl.h:1885: stray '\' > in program > /home/oracle/app/oracle/product/8.0.5/network/public/orl.h:1886: stray '\' > in program > /home/oracle/app/oracle/product/8.0.5/network/public/orl.h:1887: parse error > before `->' > /home/oracle/app/oracle/product/8.0.5/network/public/orl.h:1887: stray '\' > in program > /home/oracle/app/oracle/product/8.0.5/network/public/orl.h:1888: parse error > before `->' > /home/oracle/app/oracle/product/8.0.5/network/public/orl.h:1888: stray '\' > in program > In file included from > /home/oracle/app/oracle/product/8.0.5/network/public/oci.h:1560, > from > /home/ftp/incoming/php-4.0.1pl2/ext/oci8/php_oci8.h:56, > from internal_functions.c:39: > /home/oracle/app/oracle/product/8.0.5/network/public/ociextp.h:117: parse > error before `(' > make[2]: *** [internal_functions.lo] Error 1 > make[2]: Leaving directory `/home/ftp/incoming/php-4.0.1pl2/main' > make[1]: *** [all-recursive] Error 1 > make[1]: Leaving directory `/home/ftp/incoming/php-4.0.1pl2/main' > make: *** [all-recursive] Error 1 > [root@prisca php-4.0.1pl2]# > [root@prisca php-4.0.1pl2]# > > > > > -- > PHP Database Mailing List (http://www.php.net/) > To unsubscribe, e-mail: php-db-unsubscribe@lists.php.net > For additional commands, e-mail: php-db-help@lists.php.net > To contact the list administrators, e-mail: php-list-admin@lists.php.net -- Thies C. Arntzen "One Big-Mac, Small Fries and a Coke!" Digital Collections Phone +49 40 235350 Fax +49 40 23535180 Hammerbrookstr. 93 20097 Hamburg / Germany

« previous php.db (#2416) next »