mcrypt compile errors in 3.0.12 and 4.0b2
| From: | Mitch Vincent | Date: | Thu, 19 Aug 1999 17:15:22 +0000 |
| Subject: | mcrypt compile errors in 3.0.12 and 4.0b2 | ||
| Groups: | php.dev | ||
| Request: | Send a blank email to php-dev+get-10014@lists.php.net to get a copy of this message | ||
mcrypt.c: In function `php3_minit_mcrypt':
mcrypt.c:142: `TWOFISH' undeclared (first use in this function)
mcrypt.c:142: (Each undeclared identifier is reported only once
mcrypt.c:142: for each function it appears in.)
mcrypt.c:142: parse error before `128'
make[2]: *** [mcrypt.o] Error 1
make[2]: Leaving directory `/root/source/php-4.0b2/ext/mcrypt'
make[1]: *** [all-recursive] Error 1
make[1]: Leaving directory `/root/source/php-4.0b2/ext'
make: *** [all-recursive] Error 1
I get the same compile error with 3.0.12 and 4.0b2...
Thanks!
- Mitch