Bug #2133: enable --with-ldap don/t compile on version php4

From: Date: Mon, 23 Aug 1999 16:20:18 +0000
Subject: Bug #2133: enable --with-ldap don/t compile on version php4
Groups: php.dev 
Request: Send a blank email to php-dev+get-10108@lists.php.net to get a copy of this message
From: gmourani@videotron.ca Operating system: Linux RH6.0 PHP version: 3.0.12 PHP Bug Type: Compile Failure Bug description: enable --with-ldap don/t compile on version php4 make[2]: Entering directory `/var/tmp/php-4.0b2/ext/ldap' egcs -DHAVE_CONFIG_H -I. -I. -I../.. -I../../libzend -I../../TSRM -I/var/tmp/php-4.0b2/../apache_1.3.9/src/include -I/var/tmp/php-4.0b2/../apache_1.3.9/src/os/unix -I/usr/include/imap -I/usr/include -I/usr/local/pgsql/include -I../.. -I../../libzend -O6 -mcpu=pentiumpro -march=pentiumpro -fomit-frame-pointer -fno-exceptions -malign-loops=2 -malign-jumps=2 -malign-functions=2 -I/usr/include/openssl -c ldap.c ldap.c:70: `php3_ldap_close' undeclared here (not in a function) ldap.c:70: initializer element for `ldap_functions[1].handler' is not constant make[2]: *** [ldap.o] Error 1 make[2]: Leaving directory `/var/tmp/php-4.0b2/ext/ldap' make[1]: *** [all-recursive] Error 1 make[1]: Leaving directory `/var/tmp/php-4.0b2/ext' make: *** [all-recursive] Error 1

« previous php.dev (#10108) next »