Bug #2448: Apache 1.3.9, with mod_ssl 2.4.5, compile fails with missing modules/php3.o

From: Date: Tue, 05 Oct 1999 22:22:45 +0000
Subject: Bug #2448: Apache 1.3.9, with mod_ssl 2.4.5, compile fails with missing modules/php3.o
Groups: php.dev 
Request: Send a blank email to php-dev+get-11560@lists.php.net to get a copy of this message
From: auto15764@hushmail.com Operating system: Linux (Slackware 4, Kernel 2.2.12) PHP version: 3.0.12 PHP Bug Type: Compile Failure Bug description: Apache 1.3.9, with mod_ssl 2.4.5, compile fails with missing modules/php3.o ===> src/modules/php3 gcc -c -I../../os/unix -I../../include -DLINUX=2 -DMOD_SSL=204105 -DUSE_HSREGEX -DEAPI -DUSE_EXPAT -I../../lib/expat-lite ../../apaci mod_php3.c cp libmodphp3.a libphp3. ar r libphp3. mod_php3.o ranlib libphp3. cp libphp3. libphp3.a <=== src/modules/php3 <=== src/modules gcc -c -I./os/unix -I./include -DLINUX=2 -DMOD_SSL=204105 -DUSE_HSREGEX -DEAPI -DUSE_EXPAT -I./lib/expat-lite ./apaci modules.c gcc -c -I./os/unix -I./include -DLINUX=2 -DMOD_SSL=204105 -DUSE_HSREGEX -DEAPI -DUSE_EXPAT -I./lib/expat-lite ./apaci buildmark.c gcc -DLINUX=2 -DMOD_SSL=204105 -DUSE_HSREGEX -DEAPI -DUSE_EXPAT -I./lib/expat-lite ./apaci -L/usr/local/ssl/lib \ -o httpd buildmark.o modules.o modules/php3.o modules/standard/libstandard.a modules/ssl/libssl.a modules/php3/libphp3.a main/libmain.a ./os/unix/libos.a ap/libap.a regex/libregex.a lib/expat-lite/libexpat.a -lm -lssl -lcrypto gcc: modules/php3.o: No such file or directory make[2]: *** [target_static] Error 1 make[2]: Leaving directory `/usr/src/apache_1.3.9/src' make[1]: *** [build-std] Error 2 make[1]: Leaving directory `/usr/src/apache_1.3.9' make: *** [build] Error 2

« previous php.dev (#11560) next »