PHP 4.0 Bug #2488: compile failure with "build.mk", buildconf OK

From: Date: Mon, 11 Oct 1999 09:56:18 +0000
Subject: PHP 4.0 Bug #2488: compile failure with "build.mk", buildconf OK
Groups: php.dev 
Request: Send a blank email to php-dev+get-11683@lists.php.net to get a copy of this message
From: danny.heijl@cevi.be Operating system: Red Hat 5.2 Linux PHP version: 4.0 Latest CVS (11/10/1999) PHP Bug Type: Installation problem Bug description: compile failure with "build.mk", buildconf OK If I do : make -f build.mk cvsclean make -f build.mk ./configure --prefix=/home/local/php \ --enable-debug \ --enable-bcmath \ --enable-static \ --with-gd=/home/local \ --with-config-file-path=/home/local/apache/etc \ --with-gdbm \ --with-xml=/home/local \ --with-zlib --with-informix=yes make I get the following compile failure : make all-recursive make[1]: Entering directory `/home/php/php4' Making all in libzend make[2]: Entering directory `/home/php/php4/libzend' /bin/sh ../libtool --mode=compile gcc -DHAVE_CONFIG_H -I. -I/home/php/php4/./libzend -I.. @INCLU DES@ -I/home/local/include -I/home/local/include/xml -O2 -g -g -Wall -I/opt/informix/incl/esql -g -Wall -c zend-scanner.c gcc -DHAVE_CONFIG_H -I. -I/home/php/php4/./libzend -I.. @INCLUDES@ -I/home/local/include -I/home /local/include/xml -O2 -g -g -Wall -I/opt/informix/incl/esql -g -Wall -c zend-scanner.c -o zend- scanner.o gcc: @INCLUDES@: No such file or directory zend-scanner.c:5573: warning: `yy_fatal_error' defined but not used zend-scanner.c:5558: warning: `yy_top_state' defined but not used make[2]: *** [zend-scanner.lo] Error 1 make[2]: Leaving directory `/home/php/php4/libzend' make[1]: *** [all-recursive] Error 1 make[1]: Leaving directory `/home/php/php4' make: *** [all-recursive-am] Error 2 No problems with "buildconf". Danny. ---

« previous php.dev (#11683) next »