PHP 4.0 Bug #2573: compile dies on crypt.c
| From: | evan715 at sirius dot com | Date: | Wed, 20 Oct 1999 01:28:00 +0000 |
| Subject: | PHP 4.0 Bug #2573: compile dies on crypt.c | ||
| Groups: | php.dev | ||
| Request: | Send a blank email to php-dev+get-11775@lists.php.net to get a copy of this message | ||
From: evan715@sirius.com
Operating system: Red Hat Linux 2.2.10
PHP version: 4.0 Latest CVS (19/10/1999)
PHP Bug Type: Compile Failure
Bug description: compile dies on crypt.c
Here is the output from configure:
...
crypt.c: In function `php3_crypt':
crypt.c:122: `PHP3_MAX_SALT_LEN' undeclared (first use in this function)
crypt.c:122: (Each undeclared identifier is reported only once
crypt.c:122: for each function it appears in.)
crypt.c:122: size of array `salt' has non-integer type
make[3]: *** [crypt.lo] Error 1
make[3]: Leaving directory `/root/php4/ext/standard'
make[2]: *** [all-recursive] Error 1
make[2]: Leaving directory `/root/php4/ext'
make[1]: *** [all-recursive] Error 1
make[1]: Leaving directory `/root/php4'
make: *** [all-recursive-am] Error 2