PHP 4.0 Bug #2613: Compile dies on url.h

From: Date: Wed, 27 Oct 1999 05:41:34 +0000
Subject: PHP 4.0 Bug #2613: Compile dies on url.h
Groups: php.dev 
Request: Send a blank email to php-dev+get-11933@lists.php.net to get a copy of this message
From: evan715@sirius.com Operating system: Red Hat 6.0 PHP version: 4.0 Latest CVS (27/10/1999) PHP Bug Type: Compile Failure Bug description: Compile dies on url.h In file included from ext/standard/php3_standard.h:51, from internal_functions.c:62: ext/standard/url.h:31: redefinition of `struct url' ext/standard/url.h:40: redefinition of `url' ext/standard/url.h:40: `url' previously declared here make[2]: *** [internal_functions.lo] Error 1 make[2]: Leaving directory `/root/php4' make[1]: *** [all-recursive] Error 1 make[1]: Leaving directory `/root/php4' make: *** [all-recursive-am] Error 2

« previous php.dev (#11933) next »