PHP 4.0 Bug #2772: array.c function php3_reset return_value_used undeclared
| From: | chrisvik at tapir dot no | Date: | Fri, 19 Nov 1999 20:44:59 +0000 |
| Subject: | PHP 4.0 Bug #2772: array.c function php3_reset return_value_used undeclared | ||
| Groups: | php.dev | ||
| Request: | Send a blank email to php-dev+get-12789@lists.php.net to get a copy of this message | ||
From: chrisvik@tapir.no
Operating system: Redhat 6.0
PHP version: 4.0 Beta 3
PHP Bug Type: Compile Failure
Bug description: array.c function php3_reset return_value_used undeclared
./configure --with-apache=../apache_1.3.9 --with-solid --disable-debug --enable-track-vars
--enable-safe-mode --with-gd --with-ttf --with-zlib
make
....
/bin/sh ../../libtool --silent --mode=compile gcc -DHAVE_CONFIG_H -I. -I. -I../.. -I../../libzend
-I../.. -I../../libzend -I/usr/src/apache_1.3.9/src/include -I/usr/src/apache_1.3.9/src/os/unix
-Isolid/include -g -O2 -O2 -c -o array.lo array.c
array.c: In function `php3_reset':
array.c:582: `return_value_used' undeclared (first use in this function)
array.c:582: (Each undeclared identifier is reported only once
array.c:582: for each function it appears in.)
make[3]: *** [array.lo] Error 1
make[3]: Leaving directory `/usr/src/php-4.0b3/ext/standard'
make[2]: *** [all-recursive] Error 1
make[2]: Leaving directory `/usr/src/php-4.0b3/ext'
make[1]: *** [all-recursive] Error 1
make[1]: Leaving directory `/usr/src/php-4.0b3'
make: *** [all-recursive-am] Error 2