PHP 4.0 Bug #2783: libzend: conflicting types for `zendparse'

From: Date: Sun, 21 Nov 1999 00:44:15 +0000
Subject: PHP 4.0 Bug #2783: libzend: conflicting types for `zendparse'
Groups: php.dev 
Request: Send a blank email to php-dev+get-12832@lists.php.net to get a copy of this message
From: ide@ub.uni-kl.de Operating system: SuSE Linux 6.2 PHP version: 4.0 Beta 3 PHP Bug Type: Compile Failure Bug description: libzend: conflicting types for `zendparse' trying to compile php-4.0b3 with the following configuration: ./configure --enable-thread-safety --enable-sysvsem --enable-sysvshm --with-mm --with-mysql --with-ftp --with-apache=../apache_1.3.9 I get the following error message: ... /bin/sh ./libtool --silent --mode=compile gcc -DHAVE_CONFIG_H -I. -I/opt/down/net/apache/php-4.0b3/./libzend -I. -D_REENTRANT -D_POSIX_PTHREAD_SEMANTICS -I../TSRM -O2 -march=pentiumpro -g -g -c -o zend-parser.lo zend-parser.c /usr/lib/bison.simple:153: conflicting types for `zendparse' zend_globals_macros.h:39: previous declaration of `zendparse' /usr/lib/bison.simple: In function `zendparse': /usr/lib/bison.simple:219: number of arguments doesn't match prototype /usr/lib/bison.simple:153: prototype declaration make[2]: *** [zend-parser.lo] Error 1 make[2]: Leaving directory `/usr/local/down/net/apache/php-4.0b3/libzend' make[1]: *** [all-recursive] Error 1 make[1]: Leaving directory `/usr/local/down/net/apache/php-4.0b3' make: *** [all-recursive-am] Error 2

« previous php.dev (#12832) next »