PHP 4.0 Bug #2832: Compilation Failure, see below

From: Date: Thu, 25 Nov 1999 21:31:51 +0000
Subject: PHP 4.0 Bug #2832: Compilation Failure, see below
Groups: php.dev 
Request: Send a blank email to php-dev+get-13122@lists.php.net to get a copy of this message
From: forsyth@dataforge.on.ca Operating system: Linux 2.0.36 Redhat 5.2 PHP version: 4.0 Beta 3 PHP Bug Type: Compile Failure Bug description: Compilation Failure, see below array.c: In function `php3_reset': array.c:582: `return_value_used' undeclared (first use this function) array.c:582: (Each undeclared identifier is reported only once array.c:582: for each function it appears in.) make[3]: *** [array.lo] Error 1 make[2]: *** [all-recursive] Error 1 make[1]: *** [all-recursive] Error 1 make: *** [all-recursive-am] Error 2

« previous php.dev (#13122) next »