PHP 4.0 Bug #2999: Cannot compile
| From: | gbonanse at tesetec dot com dot br | Date: | Sat, 18 Dec 1999 16:55:37 +0000 |
| Subject: | PHP 4.0 Bug #2999: Cannot compile | ||
| Groups: | php.dev | ||
| Request: | Send a blank email to php-dev+get-13821@lists.php.net to get a copy of this message | ||
From: gbonanse@tesetec.com.br
Operating system: Linux2.2.13/Apache1.3.9
PHP version: 4.0 Latest CVS (18/12/1999)
PHP Bug Type: Compile Failure
Bug description: Cannot compile
Building process:
./buildconf
./configure --with-apxs=/usr/local/apache/bin/apxs --with-mysql=/usr --enable-track-vars
--enable-magic-quotes --disable-debug --disable-libtool-lock --without-nd
bm --disable-inline
make
make install
make distclean
Errors from make:
zend-scanner.c:5666: warning: `yy_fatal_error' defined but not used
zend-scanner.c:5651: warning: `yy_top_state' defined but not used
In file included from db.c:151:
php_db.h:71: conflicting types for `php_dbm_exists'
db.c:104: previous declaration of `php_dbm_exists'
db.c:661: redefinition of `php_dbm_exists'
php_db.h:71: `php_dbm_exists' previously defined here
db.c: In function `php_dbm_exists':
db.c:678: warning: passing arg 1 of `php_dbm_exists' from incompatible pointer type
db.c:678: incompatible type for argument 2 of `php_dbm_exists'
make[3]: *** [db.lo] Error 1
make[2]: *** [all-recursive] Error 1
make[1]: *** [all-recursive] Error 1
make: *** [all-recursive-am] Error 2
In file included from db.c:151:
php_db.h:71: conflicting types for `php_dbm_exists'
db.c:104: previous declaration of `php_dbm_exists'
db.c:661: redefinition of `php_dbm_exists'
php_db.h:71: `php_dbm_exists' previously defined here
db.c: In function `php_dbm_exists':
db.c:678: warning: passing arg 1 of `php_dbm_exists' from incompatible pointer type
db.c:678: incompatible type for argument 2 of `php_dbm_exists'
make[2]: *** [db.lo] Error 1
make[1]: *** [install-recursive] Error 1
make: *** [install-recursive] Error 1