Bug #3029: Compile failure on in PHP4 beta3 libzend/zend-parse.c
| From: | jasonp019 at yahoo dot com | Date: | Wed, 22 Dec 1999 22:46:42 +0000 |
| Subject: | Bug #3029: Compile failure on in PHP4 beta3 libzend/zend-parse.c | ||
| Groups: | php.dev | ||
| Request: | Send a blank email to php-dev+get-13949@lists.php.net to get a copy of this message | ||
From: jasonp019@yahoo.com
Operating system: RedHat 6.0
PHP version: 3.0.12
PHP Bug Type: Compile Failure
Bug description: Compile failure on in PHP4 beta3 libzend/zend-parse.c
Configure String
=============
./configure --enable-thread-safety --with-yp --enable-track-vars --enable-trans-sid
--with-apxs=/usr/local/apache/bin/apxs
Make Command Line
=================
make
make all-recursive
make[1]: Entering directory `/exports/staff1/pfeil/php-4.0b3'
Making all in libzend
make[2]: Entering directory `/exports/staff1/pfeil/php-4.0b3/libzend'
/bin/sh ./libtool --silent --mode=compile gcc -DHAVE_CONFIG_H -I.
-I/exports/staff1/pfeil/php-4.0b3/./libzend -I. -D_REENTRANT -D_POSIX_PTHREAD_SEMANTICS -I../TSRM
-g -O2 -g -c -o zend-parser.lo zend-parser.c
/usr/lib/bison.simple:153: conflicting types for `zendparse'
zend_globals_macros.h:39: previous declaration of `zendparse'
/usr/lib/bison.simple: In function `zendparse':
/usr/lib/bison.simple:219: number of arguments doesn't match prototype
/usr/lib/bison.simple:153: prototype declaration
make[2]: *** [zend-parser.lo] Error 1
make[2]: Leaving directory `/exports/staff1/pfeil/php-4.0b3/libzend'
make[1]: *** [all-recursive] Error 1
make[1]: Leaving directory `/exports/staff1/pfeil/php-4.0b3'
make: *** [all-recursive-am] Error 2
I have bison-1.28-1.i386.rpm installed. Anyone have any ideas?
Thanks!
--Jason