PHP 4.0 Bug #3048: error in configure (non-ZTS build)
| From: | danny dot heijl at cevi dot be | Date: | Sat, 25 Dec 1999 13:56:41 +0000 |
| Subject: | PHP 4.0 Bug #3048: error in configure (non-ZTS build) | ||
| Groups: | php.dev | ||
| Request: | Send a blank email to php-dev+get-14026@lists.php.net to get a copy of this message | ||
From: danny.heijl@cevi.be
Operating system: RH 6.0 Linux
PHP version: 4.0 Latest CVS (25/12/1999)
PHP Bug Type: Installation problem
Bug description: error in configure (non-ZTS build)
Latest CVS has an error in configure for non-ZTS builds :
../php4/configure --prefix=/home/local/php \
--enable-track-vars \
--enable-debug \
--disable-inline \
--enable-static \
--enable-bcmath \
--with-gd=/home/local \
--with-ftp \
--with-xml=/home/local \
--with-gdbm \
--with-zlib=/home/local \
--with-config-file-path=/home/local/apache/etc/ \
--with-informix=yes
.........snip.......
checking for AOLserver support... no
checking for Apache module support via DSO through APXS... no
checking for Apache module support... no
checking for mod_charset compatibility option... no
../php4/configure: syntax error near unexpected token `TSRM_CHECK_GCC_ARG(-rdynamic,'
../php4/configure: ../php4/configure: line 5424: ` TSRM_CHECK_GCC_ARG(-rdynamic,
gcc_rdynamic)'
make: *** No targets. Stop.
Danny
---