PHP 4.0 Bug #3193: crypt.c compile failure

From: Date: Wed, 12 Jan 2000 17:48:36 +0000
Subject: PHP 4.0 Bug #3193: crypt.c compile failure
Groups: php.dev 
Request: Send a blank email to php-dev+get-14549@lists.php.net to get a copy of this message
From: doussot@gifrance.com Operating system: Linux 2.2 - glibc 2.1 - gcc 2.95 PHP version: 4.0 Latest CVS (12/01/2000) PHP Bug Type: Compile Failure Bug description: crypt.c compile failure gcc -DHAVE_CONFIG_H -I. -I/usr/local/web/src/php4/ext/standard -I../.. -I../../Zend -I/usr/local/web/src/php4 -I/usr/local/web/src/apache_1.3.9/src/include -I/usr/local/web/src/apache_1.3.9/src/os/unix -I/usr/include/imap -I/usr/local/include -I/usr/include/mysql -I/usr/local/oracle/rdbms/demo -I/usr/local/oracle/network/public -I/usr/local/oracle/plsql/public -I/usr/local/oracle/rdbms/demo -I/usr/local/oracle/network/public -I/usr/local/oracle/plsql/public -I/opt/sybase-11.9.2/include -I/usr/local/web/src/apache_1.3.9/src/lib/expat-lite -D_REENTRANT -g -O2 -c crypt.c && touch crypt.lo crypt.c: In function `php_if_crypt': crypt.c:122: `PHP3_MAX_SALT_LEN' undeclared (first use in this function) crypt.c:122: (Each undeclared identifier is reported only once crypt.c:122: for each function it appears in.) crypt.c:122: size of array `salt' has non-integer type make[3]: *** [crypt.lo] Error 1 make[3]: Leaving directory `/usr/local/web/src/php4/ext/standard' make[2]: *** [all-recursive] Error 1 make[2]: Leaving directory `/usr/local/web/src/php4/ext/standard' make[1]: *** [all] Error 1 make[1]: Leaving directory `/usr/local/web/src/php4/ext' make: *** [all-recursive] Error 1

« previous php.dev (#14549) next »