PHP 4.0 Bug #3230: IS_NULL not defined in php_mysql.c

From: Date: Mon, 17 Jan 2000 10:23:21 +0000
Subject: PHP 4.0 Bug #3230: IS_NULL not defined in php_mysql.c
Groups: php.dev 
Request: Send a blank email to php-dev+get-14705@lists.php.net to get a copy of this message
From: maxkir@email.com Operating system: Solaris 7 x86 PHP version: 4.0 Latest CVS (17/01/2000) PHP Bug Type: Compile Failure Bug description: IS_NULL not defined in php_mysql.c magnat!kir$ mysql --version mysql Ver 9.32 Distrib 3.22.22, for pc-solaris2.7 (i386) Configure line: ./configure \ --with-gd --with-oracle=/u/oracle7 \ --with-mysql \ --with-config-file-path=/h/home/kir/SOFT/conf \ --with-apxs=/h/home/kir/SOFT/bin/apxs \ --enable-debug=no --enable-magic-quotes=yes \ --enable-memory-limit=yes --enable-url-fopen-wrapper=no \ --enable-sysvsem=yes --enable-sysvshm=yes \ --enable-track-vars=yes --with-system-regex \ --enable-versioning --enable-safe-mode --with-gdbm Compile error: Making all in mysql make[2]: Entering directory `/h/home/kir/SRC/php4/ext/mysql' make[3]: Entering directory `/h/home/kir/SRC/php4/ext/mysql' /bin/sh ../../libtool --silent --mode=compile gcc -DHAVE_CONFIG_H -I. -I/h/home/ kir/SRC/php4/ext/mysql -I../.. -I../../Zend -I/h/home/kir/SRC/php4 -I/h/home/kir /SOFT/include -I/usr/local/include -I/usr/local/include/mysql -I/u/oracle7/rdbms /demo -I/u/oracle7/network/public -D_POSIX_PTHREAD_SEMANTICS -D_REENTRANT -g -O 2 -c php_mysql.c php_mysql.c: In function `php_if_mysql_result': php_mysql.c:1260: `IS_NULL' undeclared (first use in this function) php_mysql.c:1260: (Each undeclared identifier is reported only once php_mysql.c:1260: for each function it appears in.) make[3]: *** [php_mysql.lo] Error 1 make[3]: Leaving directory `/h/home/kir/SRC/php4/ext/mysql' make[2]: *** [all-recursive] Error 1 make[2]: Leaving directory `/h/home/kir/SRC/php4/ext/mysql' make[1]: *** [all] Error 1 make[1]: Leaving directory `/h/home/kir/SRC/php4/ext' make: *** [all-recursive] Error 1

« previous php.dev (#14705) next »