PHP 4.0 Bug #3335: php4b3 fails on compile
| From: | luisbravo at bigfoot dot com | Date: | Fri, 28 Jan 2000 03:01:35 +0000 |
| Subject: | PHP 4.0 Bug #3335: php4b3 fails on compile | ||
| Groups: | php.dev | ||
| Request: | Send a blank email to php-dev+get-14970@lists.php.net to get a copy of this message | ||
From: luisbravo@bigfoot.com
Operating system: Linux Mandrake 7.0
PHP version: 4.0 Beta 3
PHP Bug Type: Compile Failure
Bug description: php4b3 fails on compile
When I try to compile php4b3 I get the following
-------------
make all-recursive
make[1]: Entering directory `/root/soft/php-4.0b3'
Making all in libzend
make[2]: Entering directory `/root/soft/php-4.0b3/libzend'
/bin/sh ./libtool --silent --mode=compile gcc -DHAVE_CONFIG_H -I. -I/root/soft/php-4.0b3/./libzend
-I. -D_REENTRANT -D_POSIX_PTHREAD_SEMANTICS -I../TSRM -O2 -g -g -c -o zend-parser.lo
zend-parser.c
/usr/lib/bison.simple:153: conflicting types for `zendparse'
zend_globals_macros.h:39: previous declaration of `zendparse'
/usr/lib/bison.simple: In function `zendparse':
/usr/lib/bison.simple:219: number of arguments doesn't match prototype
/usr/lib/bison.simple:153: prototype declaration
make[2]: *** [zend-parser.lo] Error 1
make[2]: Leaving directory `/root/soft/php-4.0b3/libzend'
make[1]: *** [all-recursive] Error 1
make[1]: Leaving directory `/root/soft/php-4.0b3'
make: *** [all-recursive-am] Error 2
------------
./configure line
CFLAGS='-O2' ./configure --with-apxs=/apache/bin/apxs \
--prefix=/opt/php4 \
--with-config-file-path=/opt/apache/conf \
--disable-short-tags \
--enable-versioning \
--without-gd \
--enable-sysvsem \
--enable-sysvshm \
--with-xml=shared,/opt/apache \
--with-gnu-ld \
--enable-thread-safety \
--enable-track-vars
------------
bison version
bison-1.28-1mdk