PHP 4.0 Bug #3394: Error in "zend_execute.lo/c"

From: Date: Thu, 03 Feb 2000 13:38:14 +0000
Subject: PHP 4.0 Bug #3394: Error in "zend_execute.lo/c"
Groups: php.dev 
Request: Send a blank email to php-dev+get-15165@lists.php.net to get a copy of this message
From: thomas@du.no Operating system: Linux - Slackware7.0 PHP version: 4.0 Beta 3 PHP Bug Type: Compile Failure Bug description: Error in "zend_execute.lo/c" When doing "make" I get the following error : /UPGRADE/php-4.0b3/./libzend -I. -g -O2 -g -c -o zend_execute.lo zend_execut e.c zend_execute.c: In function `execute': zend_execute.c:2118: virtual memory exhausted make[2]: *** [zend_execute.lo] Error 1 make[2]: Leaving directory `/home/thomas/UPGRADE/php-4.0b3/libzend' make[1]: *** [all-recursive] Error 1 make[1]: Leaving directory `/home/thomas/UPGRADE/php-4.0b3' make: *** [all-recursive-am] Error 2 du_filserv:/home/thomas/UPGRADE/php-4.0b3#

« previous php.dev (#15165) next »