Bug #3451: Build error with SNMP

From: Date: Thu, 10 Feb 2000 18:11:46 +0000
Subject: Bug #3451: Build error with SNMP
Groups: php.dev 
Request: Send a blank email to php-dev+get-15364@lists.php.net to get a copy of this message
From: kphannan@nscorp.com Operating system: Linux RH6.0 PHP version: 3.0.14 PHP Bug Type: Compile Failure Bug description: Build error with SNMP make[3]: Entering directory `/opt/db/download/web/php/php-4.0b3/ext/snmp' /bin/sh ../../libtool --silent --mode=compile gcc -DHAVE_CONFIG_H -I. -I. -I../.. -I../../libzend -I../.. -I../../libzend -I/opt/db/download/web/apache/apache_1.3.11/src/include -I/opt/db/download/web/apache/apache_1.3.11/src/os/unix -I/opt/db/ldap/include -I/usr/include/mysql -I/opt/db/snmp/include/ucd-snmp -I/opt/sybase/include -I../.. -I../../libzend -g -O2 -g -O2 -c -o snmp.lo snmp.c snmp.c: In function `_php3_snmp': snmp.c:146: `DS_LIBRARY_ID' undeclared (first use in this function) snmp.c:146: (Each undeclared identifier is reported only once snmp.c:146: for each function it appears in.) snmp.c:146: `DS_LIB_QUICK_PRINT' undeclared (first use in this function) make[3]: *** [snmp.lo] Error 1 make[3]: Leaving directory `/opt/db/download/web/php/php-4.0b3/ext/snmp' make[2]: *** [all-recursive] Error 1 make[2]: Leaving directory `/opt/db/download/web/php/php-4.0b3/ext' make[1]: *** [all-recursive] Error 1 make[1]: Leaving directory `/opt/db/download/web/php/php-4.0b3' make: *** [all-recursive-am] Error 2 ./configure --with-mysql --with-apache=../../apache/apache_1.3.11 --enable-track-vars --with-ldap=/opt/db/ldap --with-snmp=/opt/db/snmp --with-sybase=$SYBASE

« previous php.dev (#15364) next »