PHP 4.0 Bug #3512: compiling --with-java fails on PHP4 CVS
| From: | yusufg at outblaze dot com | Date: | Thu, 17 Feb 2000 03:26:32 +0000 |
| Subject: | PHP 4.0 Bug #3512: compiling --with-java fails on PHP4 CVS | ||
| Groups: | php.dev | ||
| Request: | Send a blank email to php-dev+get-15622@lists.php.net to get a copy of this message | ||
From: yusufg@outblaze.com
Operating system: Linux 2.2.12
PHP version: 4.0 Latest CVS (17/02/2000)
PHP Bug Type: Compile Failure
Bug description: compiling --with-java fails on PHP4 CVS
Platform, Linux 2.2.12 / redhat 6.0
Sources in /usr/local/src/{php4,Zend,TSRM}
Build tree in /usr/local/src/phpbuild
Running the following configure command
../php4/configure --with-apache=/usr/local/src/apache_1.3.9 \
--with-mysql=/usr/local/site/mysql --enable-track-vars \
--enable-magic-quotes \
--with-db2=/usr/local/site/BerkeleyDB \
--with-ldap=/usr/local/site/ldap \
--with-java=/usr/local/site/jdk118 \
--disable-debug --with-config-file-path=/usr/local/site/ \
--prefix=/usr/local/site/php
results in the following error
Making shared in java
make[2]: Entering directory `/usr/local/src/phpbuild/ext/java'
make[3]: Entering directory `/usr/local/src/phpbuild/ext/java'
cp: reflect.java: No such file or directory
make[3]: *** [php_java.jar] Error 1
make[3]: Leaving directory `/usr/local/src/phpbuild/ext/java'
make[2]: *** [shared] Error 2
make[2]: Leaving directory `/usr/local/src/phpbuild/ext/java'
make[1]: *** [all] Error 1
make[1]: Leaving directory `/usr/local/src/phpbuild/ext'
make: *** [all-recursive] Error 1