PHP 4.0 Bug #3545: crypt functions fail to compile

From: Date: Mon, 21 Feb 2000 09:34:18 +0000
Subject: PHP 4.0 Bug #3545: crypt functions fail to compile
Groups: php.dev 
Request: Send a blank email to php-dev+get-15745@lists.php.net to get a copy of this message
From: rolf@suse.de Operating system: SuSE Linux PHP version: 4.0 Latest CVS (21/02/2000) PHP Bug Type: Compile Failure Bug description: crypt functions fail to compile in BETA4 the compile fails in the crypt functions: /bin/sh ../../libtool --silent --mode=compile gcc -DHAVE_CONFIG_H -I. -I/usr/src/packages/BUILD/php-4.0b4/php-4.0b4/ext/standard -I../.. -I../../Zend -I/usr/src/packages/BUILD/php-4.0b4/php-4.0b4 -I/usr/local/httpd/include -I/usr/include/imap -I/usr/include/mysql -I/usr/lib/pgsql/include -I/usr/include/ucd-snmp -I/usr/src/packages/BUILD/php-4.0b4/php-4.0b4/ext/xml/expat/xmltok -I/usr/src/packages/BUILD/php-4.0b4/php-4.0b4/ext/xml/expat/xmlparse -DXML_BYTE_ORDER=12 -D_REENTRANT -O2 -m486 -fno-strength-reduce -I/usr/include/ucd-snmp -I/usr/include/gd -g -Wall -c browscap.c /bin/sh ../../libtool --silent --mode=compile gcc -DHAVE_CONFIG_H -I. -I/usr/src/packages/BUILD/php-4.0b4/php-4.0b4/ext/standard -I../.. -I../../Zend -I/usr/src/packages/BUILD/php-4.0b4/php-4.0b4 -I/usr/local/httpd/include -I/usr/include/imap -I/usr/include/mysql -I/usr/lib/pgsql/include -I/usr/include/ucd-snmp -I/usr/src/packages/BUILD/php-4.0b4/php-4.0b4/ext/xml/expat/xmltok -I/usr/src/packages/BUILD/php-4.0b4/php-4.0b4/ext/xml/expat/xmlparse -DXML_BYTE_ORDER=12 -D_REENTRANT -O2 -m486 -fno-strength-reduce -I/usr/include/ucd-snmp -I/usr/include/gd -g -Wall -c crypt.c crypt.c: In function `php_if_crypt': crypt.c:120: `PHP3_MAX_SALT_LEN' undeclared (first use in this function) crypt.c:120: (Each undeclared identifier is reported only once crypt.c:120: for each function it appears in.) crypt.c:120: size of array `salt' has non-integer type crypt.c: At top level: crypt.c:111: warning: `php_to64' defined but not used make[3]: *** [crypt.lo] Error 1 make[3]: Leaving directory `/usr/src/packages/BUILD/php-4.0b4/php-4.0b4/ext/standard' make[2]: *** [all-recursive] Error 1 make[2]: Leaving directory `/usr/src/packages/BUILD/php-4.0b4/php-4.0b4/ext/standard' make[1]: *** [all] Error 1 make[1]: Leaving directory `/usr/src/packages/BUILD/php-4.0b4/php-4.0b4/ext' make: *** [all-recursive] Error 1 Bad exit status from /var/tmp/rpm-tmp.41335 (%build)

« previous php.dev (#15745) next »