Re: PHP 4.0 Bug #3642: can't compile with sybase support

From: Date: Sun, 27 Feb 2000 16:19:37 +0000
Subject: Re: PHP 4.0 Bug #3642: can't compile with sybase support
References: 1  Groups: php.dev 
Request: Send a blank email to php-dev+get-16075@lists.php.net to get a copy of this message
This should be fixed in the latest CVS. Please try it out (http://www.php.net/version4/cvs.php). Zeev On 27 Feb 2000 k@les.cz wrote: > From: k@les.cz > Operating system: Redhat 6.1 (kernel 2.2.14) > PHP version: 4.0 Beta 4 Patch Level 1 > PHP Bug Type: Compile Failure > Bug description: can't compile with sybase support > > ./configure --with-apache=../apache_1.3.11 --with-sybase=/opt/sybase/ --enable-track-vars > > make[3]: Entering directory `/usr/local/people/koles/local/src/php-4.0b4pl1/ext/sybase' > gcc -DHAVE_CONFIG_H -I. -I/usr/local/people/koles/local/src/php-4.0b4pl1/ext/sybase -I../.. > -I../../Zend -I/usr/local/people/koles/local/src/php-4.0b4pl1 > -I/usr/local/people/koles/local/src/apache_1.3.11/src/include > -I/usr/local/people/koles/local/src/apache_1.3.11/src/os/unix -I/opt/sybase//include -D_REENTRANT > -g -O2 -Wall -c sybase.c && touch sybase.lo > sybase.c: In function `php_sybase_do_connect': > sybase.c:260: `list' undeclared (first use in this function) > sybase.c:260: (Each undeclared identifier is reported only once > sybase.c:260: for each function it appears in.) > sybase.c:261: `plist' undeclared (first use in this function) > sybase.c: In function `php_if_sybase_fetch_object': > sybase.c:952: warning: implicit declaration of function `php_sybase_fetch_hash' > sybase.c: At top level: > sybase.c:907: warning: `php_if_sybase_fetch_hash' defined but not used > make[3]: *** [sybase.lo] Error 1 > make[3]: Leaving directory `/usr/local/people/koles/local/src/php-4.0b4pl1/ext/sybase' > make[2]: *** [all-recursive] Error 1 > make[2]: Leaving directory `/usr/local/people/koles/local/src/php-4.0b4pl1/ext/sybase' > make[1]: *** [all] Error 1 > make[1]: Leaving directory `/usr/local/people/koles/local/src/php-4.0b4pl1/ext' > make: *** [all-recursive] Error 1 > > > > -- Zeev Suraski <zeev@zend.com> http://www.zend.com/

« previous php.dev (#16075) next »