PHP 4.0 Bug #3731: Compile errors in crypr.c

From: Date: Sun, 05 Mar 2000 13:17:47 +0000
Subject: PHP 4.0 Bug #3731: Compile errors in crypr.c
Groups: php.dev 
Request: Send a blank email to php-dev+get-16408@lists.php.net to get a copy of this message
From: andres.karner@mail.ee Operating system: RedHat 6.0 PHP version: 4.0 Beta 4 Patch Level 1 PHP Bug Type: Compile Failure Bug description: Compile errors in crypr.c I made ./configure --with-apxs=/usr/sbin/apxs --with-mysql --with-xml and then make gives: crypt.c: In function `php_if_crypt': crypt.c:120: `PHP3_MAX_SALT_LEN' undeclared (first use in this function) crypt.c:120: (Each undeclared identifier is reported only once crypt.c:120: for each function it appears in.) crypt.c:120: size of array `salt' has non-integer type crypt.c: At top level: crypt.c:111: warning: `php_to64' defined but not used make[3]: *** [crypt.lo] Error 1 make[3]: Leaving directory `/home/andres/tmp/php-4.0b4pl1/ext/standard' make[2]: *** [all-recursive] Error 1 make[2]: Leaving directory `/home/andres/tmp/php-4.0b4pl1/ext/standard' make[1]: *** [all] Error 1 make[1]: Leaving directory `/home/andres/tmp/php-4.0b4pl1/ext' make: *** [all-recursive] Error 1

« previous php.dev (#16408) next »