PHP 4.0 Bug #3767: Interbase module does not compile

From: Date: Wed, 08 Mar 2000 15:27:42 +0000
Subject: PHP 4.0 Bug #3767: Interbase module does not compile
Groups: php.dev 
Request: Send a blank email to php-dev+get-16539@lists.php.net to get a copy of this message
From: doom@tkwcy.ee Operating system: RedHat 5.0 PHP version: 4.0 Beta 4 Patch Level 1 PHP Bug Type: Compile Failure Bug description: Interbase module does not compile when compiling latest beta of PHP 4.0 with interbase, such a message appears: (compiler gcc 2.7.2.3) gcc -DHAVE_CONFIG_H -I. -I/home/AK/jesmin/wrk/php4/php-4.0b4pl1/ext/interbase -I../.. -I../../Zend -I/home/AK/jesmin/wrk/php4/php-4.0b4pl1 -I/usr/interbase/include -D_REENTRANT -g -O2 -Wall -c interbase.c && touch interbase.lo interbase.c:30: php_string.h: No such file or directory make[3]: *** [interbase.lo] Error 1 make[3]: Leaving directory `/home/AK/jesmin/wrk/php4/php-4.0b4pl1/ext/interbase'make[2]: *** [all-recursive] Error 1 make[2]: Leaving directory `/home/AK/jesmin/wrk/php4/php-4.0b4pl1/ext/interbase'make[1]: *** [all] Error 1 make[1]: Leaving directory `/home/AK/jesmin/wrk/php4/php-4.0b4pl1/ext' make: *** [all-recursive] Error 1 After some hacking around there were also some other errors after fixing the include problem. Anyway, for me it works with this patch: http://erasmus.cs.ut.ee/~jesmin/stuff/interbase.php.patch

« previous php.dev (#16539) next »