PHP 4.0 Bug #3839: domxml fails to compile again :)

From: Date: Wed, 15 Mar 2000 18:40:57 +0000
Subject: PHP 4.0 Bug #3839: domxml fails to compile again :)
Groups: php.dev 
Request: Send a blank email to php-dev+get-16845@lists.php.net to get a copy of this message
From: simon@airdmhor.gen.nz Operating system: Linux RH6, 2.2.5-22 kernel PHP version: 4.0 Latest CVS (15/03/2000) PHP Bug Type: Compile Failure Bug description: domxml fails to compile again :) domxml.c:710: warning: `#ifdef' argument starts with a digit domxml.c: In function `php_if_domxml_children': domxml.c:551: structure has no member named `children' domxml.c:553: structure has no member named `children' domxml.c: In function `php_if_domxml_attributes': domxml.c:707: warning: implicit declaration of function `node_attributes' domxml.c:680: warning: unused variable `attr' domxml.c: In function `php_if_domxml_rootnew': domxml.c:764: structure has no member named `children' domxml.c: In function `php_if_domxml_root': domxml.c:827: structure has no member named `children' domxml.c: At top level: domxml.c:1194: warning: node_attributes' was declared implicitly extern' and later `static' domxml.c:707: warning: previous declaration of `node_attributes' domxml.c: In function `node_attributes': domxml.c:1219: structure has no member named `children' domxml.c: In function `node_children': domxml.c:1277: structure has no member named `children' domxml.c:1232: warning: unused variable `namespace' domxml.c: In function `php_if_xmltree': domxml.c:1315: structure has no member named `children' domxml.c:1291: warning: unused variable `attributes' domxml.c:1291: warning: unused variable `proot' domxml.c: At top level: domxml.c:32: warning: `le_domxmlnsp' defined but not used domxml.c:38: warning: `domxmltestnode_class_entry_ptr' defined but not used domxml.c:84: warning: `php_domxmltestnode_class_functions' defined but not used domxml.c:1155: warning: `node_namespace' defined but not used make[4]: *** [domxml.lo] Error 1 make[4]: Leaving directory `/var/home/simon/src/php4/ext/domxml' make[3]: *** [all-recursive] Error 1 make[3]: Leaving directory `/var/home/simon/src/php4/ext/domxml' make[2]: *** [all] Error 1 make[2]: Leaving directory `/var/home/simon/src/php4/ext' make[1]: *** [all-recursive] Error 1 make[1]: Leaving directory `/var/home/simon/src/php4' make: *** [php4-make] Error 2

« previous php.dev (#16845) next »