Compilation problem php-4.0b4pl1
| From: | Asghar Nafarieh | Date: | Wed, 22 Mar 2000 17:36:13 +0000 |
| Subject: | Compilation problem php-4.0b4pl1 | ||
| Groups: | php.dev | ||
| Request: | Send a blank email to php-dev+get-17144@lists.php.net to get a copy of this message | ||
Hi,
I tried to compile php-4.0b4pl1 on my linux using
./configure --with-apxs --with-imap=../imap-4.7b/c-client --with-xml
--enable-track-vars
and I get the following error. Any suggestion?
Thanks,
-Asghar
/bin/sh ../../libtool --silent --mode=compile gcc -DHAVE_CONFIG_H -I.
-I/usr/local/src/php-4.0b4pl1/ext/standard -I../.. -I../../Zend
-I/usr/local/src/php-4.0b4pl1 -I/usr/include/apache
-I/usr/local/src/imap-4.7b/c-client/include
-I/usr/local/src/php-4.0b4pl1/ext/xml/expat/xmltok
-I/usr/local/src/php-4.0b4pl1/ext/xml/expat/xmlparse -DXML_BYTE_ORDER=12
-D_REENTRANT -g -O2 -Wall -c crypt.c
crypt.c: In function `php_if_crypt':
crypt.c:120: `PHP3_MAX_SALT_LEN' undeclared (first use in this function)
crypt.c:120: (Each undeclared identifier is reported only once
crypt.c:120: for each function it appears in.)
crypt.c:120: size of array `salt' has non-integer type
crypt.c: At top level:
crypt.c:111: warning: `php_to64' defined but not used
make[3]: *** [crypt.lo] Error 1
make[3]: Leaving directory `/usr/local/src/php-4.0b4pl1/ext/standard'
make[2]: *** [all-recursive] Error 1
make[2]: Leaving directory `/usr/local/src/php-4.0b4pl1/ext/standard'
make[1]: *** [all] Error 1
make[1]: Leaving directory `/usr/local/src/php-4.0b4pl1/ext'
make: *** [all-recursive] Error 1
root%