PHP 4.0 Bug #3947: php-4.0RC1 - Compile failure in basic_function.c
| From: | kannan_narayanan at hotmail dot com | Date: | Tue, 28 Mar 2000 17:38:09 +0000 |
| Subject: | PHP 4.0 Bug #3947: php-4.0RC1 - Compile failure in basic_function.c | ||
| Groups: | php.dev | ||
| Request: | Send a blank email to php-dev+get-17328@lists.php.net to get a copy of this message | ||
From: kannan_narayanan@hotmail.com
Operating system: HP-UX10.20
PHP version: 4.0 Beta 4 Patch Level 1
PHP Bug Type: Compile Failure
Bug description: php-4.0RC1 - Compile failure in basic_function.c
PHP 4.0 RC1 fails to compile on HP-UX10.20 .
The error message is as follows:
basic_functions.c:324: `php_if_dl' undeclared here (not in a function)
basic_functions.c:324: initializer element is not constant
basic_functions.c:324: (near initialization for `basic_functions[201].handler')
basic_functions.c: In function `php_info_basic':
basic_functions.c:708: warning: implicit declaration of function `php_info_dl'
gmake[3]: *** [basic_functions.lo] Error 1
gmake[3]: Leaving directory `/1a/home/rzzx59/downloads/php-4.0RC1/ext/standard'
gmake[2]: *** [all-recursive] Error 1
gmake[2]: Leaving directory `/1a/home/rzzx59/downloads/php-4.0RC1/ext/standard'
gmake[1]: *** [all] Error 1
gmake[1]: Leaving directory `/1a/home/rzzx59/downloads/php-4.0RC1/ext'
gmake: *** [all-recursive] Error 1