PHP 4.0 Bug #3951: domxml.c fails during compile
| From: | vince at mha dot ca | Date: | Tue, 28 Mar 2000 22:50:11 +0000 |
| Subject: | PHP 4.0 Bug #3951: domxml.c fails during compile | ||
| Groups: | php.dev | ||
| Request: | Send a blank email to php-dev+get-17332@lists.php.net to get a copy of this message | ||
From: vince@mha.ca
Operating system: RedHat 6.2beta
PHP version: 4.0 Beta 4 Patch Level 1
PHP Bug Type: Compile Failure
Bug description: domxml.c fails during compile
./configure --enable-xml --with-dom=/usr #This works under b4pl1
#--- cut out extra working stuff
make[2]: Entering directory `/usr/local/src/php-4.0RC1/ext/domxml'
make[3]: Entering directory `/usr/local/src/php-4.0RC1/ext/domxml'
gcc -DHAVE_CONFIG_H -I. -I/usr/local/src/php-4.0RC1/ext/domxml -I../.. -I../../Z
end -I/usr/local/src/php-4.0RC1 -I/usr/include/freetype -I/usr/local/src/php-4.0
RC1/ext/mysql/libmysql -I/usr/odbcsdk/include -I/usr/local/src/php-4.0RC1/ext/xm
l/expat/xmltok -I/usr/local/src/php-4.0RC1/ext/xml/expat/xmlparse -DXML_BYTE_OR
DER=12 -D_REENTRANT -g -O2 -c domxml.c && touch domxml.lo
domxml.c: In function `php_if_domxml_rootnew':
domxml.c:764: structure has no member named `children'
domxml.c: In function `php_if_domxml_root':
domxml.c:827: structure has no member named `children'
domxml.c: At top level:
domxml.c:1194: warning:
node_attributes' was declared implicitly extern' and
later `static'
domxml.c:707: warning: previous declaration of `node_attributes'
domxml.c: In function `node_attributes':
domxml.c:1219: structure has no member named `children'
domxml.c: In function `node_children':
domxml.c:1277: structure has no member named `children'
domxml.c: In function `php_if_xmltree':
domxml.c:1315: structure has no member named `children'
make[3]: *** [domxml.lo] Error 1
make[3]: Leaving directory `/usr/local/src/php-4.0RC1/ext/domxml'
make[2]: *** [all-recursive] Error 1
make[2]: Leaving directory `/usr/local/src/php-4.0RC1/ext/domxml'
make[1]: *** [all] Error 1
make[1]: Leaving directory `/usr/local/src/php-4.0RC1/ext'
make: *** [all-recursive] Error 1