PHP 4.0 Bug #3966: Compile fails with Stronghold 2.3/Apache 1.2.6

From: Date: Wed, 29 Mar 2000 21:58:07 +0000
Subject: PHP 4.0 Bug #3966: Compile fails with Stronghold 2.3/Apache 1.2.6
Groups: php.dev 
Request: Send a blank email to php-dev+get-17361@lists.php.net to get a copy of this message
From: nels@maei.ca Operating system: Redhat Linux, kernel 2.2.14 PHP version: 4.0 Release Candidate 1 PHP Bug Type: Compile Failure Bug description: Compile fails with Stronghold 2.3/Apache 1.2.6 Output from make: ---- mod_php4.c: In function `php_apache_log_message': mod_php4.c:282: `requset_rec' undeclared (first use this function) mod_php4.c:282: (Each undeclared identifier is reported only once mod_php4.c:282: for each function it appears in.) mod_php4.c:282: parse error before `)' make[3]: *** [mod_php4.lo] Error 1 make[3]: Leaving directory `/usr/local/www/src/php-4.0RC1/sapi/apache' make[2]: *** [all-recursive] Error 1 make[2]: Leaving directory `/usr/local/www/src/php-4.0RC1/sapi/apache' make[1]: *** [all-recursive] Error 1 make[1]: Leaving directory `/usr/local/www/src/php-4.0RC1/sapi' make: *** [all-recursive] Error 1 ---- Configured as: ---- ./configure --with-config-file-path=/usr/local/www/conf --with-apache=/usr/local/www --with-gd --with-gdbm --with-db2 --with-mysql --with-xml --with-ldap --with-imap=/usr/src/redhat/BUILD/imap --with-pdflib --with-zlib --enable-sysvshm=yes --enable-sysvsem=yes --enable-track-vars=yes --enable-bcmath=yes --enable-memory-limit=yes ---- Server information: Stronghold/2.3 Apache/1.2.6 C2NetUS/2010 ---- Environment variables set, as per info on CNet website pertaining to PHP configuration with Stronghold: CFLAGS=-DSTRONGHOLD -I/usr/local/www/ssl/include

« previous php.dev (#17361) next »