PHP 4.0 Bug #3970: Compile Failure with --with-esoob
| From: | jaime at wheelman dot org | Date: | Wed, 29 Mar 2000 23:41:34 +0000 |
| Subject: | PHP 4.0 Bug #3970: Compile Failure with --with-esoob | ||
| Groups: | php.dev | ||
| Request: | Send a blank email to php-dev+get-17367@lists.php.net to get a copy of this message | ||
From: jaime@wheelman.org
Operating system: FreeBSD 3.4-stable
PHP version: 4.0 Latest CVS (29/03/2000)
PHP Bug Type: Compile Failure
Bug description: Compile Failure with --with-esoob
Note - Building with php4-latest from today (03291445). Did not have problems compiling (same
configure) with a previous php4-latest (sometime in between b4 and Rc1). RC1 also gives me the
problem below.
Running latest ODBC-ODBC bridge (1.0.0.6)
My configure:
./configure --with-config-file-path=/usr/local/etc/php --enable-safe-mode --disable-debug
--with-exec-dir=/usr/local/etc/php/bin --with-apxs --with-mod_charset --with-ftp
--with-gd=/usr/local --with-imap --enable-trans-sid --enable-ucd-snmp-hack --with-regex=apache
--enable-sysvsem --enable-sysvshm --enable-wddx --enable-xml --with-gdbm=/usr/local --with-ndbm
--with-dbase --with-mm --with-tsrm-pthreads --with-openssl --with-jpeg-dir=/usr/local --with-mysql
--with-zlib=/usr --with-esoob --with-snmp --enable-memory-limit
gmake output: (odbc part)
Making all in odbc
gmake[2]: Entering directory `/data/work/web/php4-200003291445/ext/odbc'
gmake[3]: Entering directory `/data/work/web/php4-200003291445/ext/odbc'
/bin/sh ../../libtool --silent --mode=compile gcc -DHAVE_CONFIG_H -I.
-I/data/work/web/php4-200003291445/ext/odbc -I../.. -I../../Z$
php_odbc.c: In function `php_if_odbc_execute':
php_odbc.c:849: parse error before `FAR'
php_odbc.c:852: parse error before `FAR'
gmake[3]: *** [php_odbc.lo] Error 1
gmake[3]: Leaving directory `/data/work/web/php4-200003291445/ext/odbc'
gmake[2]: *** [all-recursive] Error 1
gmake[2]: Leaving directory `/data/work/web/php4-200003291445/ext/odbc'
gmake[1]: *** [all] Error 1
gmake[1]: Leaving directory `/data/work/web/php4-200003291445/ext'
gmake: *** [all-recursive] Error 1