PHP 4.0 Bug #4023: Complie fails on "basic_functions.c:324: `php_if_dl' undeclared here"
| From: | texas at ludd dot luth dot se | Date: | Tue, 04 Apr 2000 07:33:18 +0000 |
| Subject: | PHP 4.0 Bug #4023: Complie fails on "basic_functions.c:324: `php_if_dl' undeclared here" | ||
| Groups: | php.dev | ||
| Request: | Send a blank email to php-dev+get-17583@lists.php.net to get a copy of this message | ||
From: texas@ludd.luth.se
Operating system: Linux 2.2.14
PHP version: 4.0 Release Candidate 1
PHP Bug Type: Compile Failure
Bug description: Complie fails on "basic_functions.c:324: `php_if_dl' undeclared
here"
Using Slackware 7.0. PHP 4.0 Beta 4 works great but RC1 dies when compiling.
Configured with:
./configure --with-mysql=/usr/local/mysql/ --with-apache=../apache_1.3.12 --enable-track-vars
--disable-debug --disable-magic-quotes --disable-shared
make generates the following error:
include -I/root/apps2/apache_1.3.12/src/os/unix -I/usr/local/mysql//include
-I/root/apps2/php-4.0RC1/ext/xml/expat/xmltok -I/root/apps2/php-4.0RC1/ext/xml/expat/xmlparse
-DXML_BYTE_ORDER=12 -D_REENTRANT -g -O2 -c basic_functions.c && touch basic_functions.lo
basic_functions.c:324: `php_if_dl' undeclared here (not in a function)
basic_functions.c:324: initializer element for `basic_functions[201].handler' is not constant
make[3]: *** [basic_functions.lo] Error 1
make[3]: Leaving directory `/root/apps2/php-4.0RC1/ext/standard'
make[2]: *** [all-recursive] Error 1
make[2]: Leaving directory `/root/apps2/php-4.0RC1/ext/standard'
make[1]: *** [all] Error 1
make[1]: Leaving directory `/root/apps2/php-4.0RC1/ext'
make: *** [all-recursive] Error 1