PHP 4.0 Bug #4038: compilation fails on basic_functions.c:324
| From: | boerm at u dot washington dot edu | Date: | Tue, 04 Apr 2000 23:04:14 +0000 |
| Subject: | PHP 4.0 Bug #4038: compilation fails on basic_functions.c:324 | ||
| Groups: | php.dev | ||
| Request: | Send a blank email to php-dev+get-17616@lists.php.net to get a copy of this message | ||
From: boerm@u.washington.edu
Operating system: Compaq Tru64 4.0D (alphaev56-dec-osf4.0d)
PHP version: 4.0 Release Candidate 1
PHP Bug Type: Compile Failure
Bug description: compilation fails on basic_functions.c:324
Quoting from std output:
basic_functions.c:324: `php_if_dl' undeclared here (not in a function)
basic_functions.c:324: initializer element is not constant
basic_functions.c:324: (near initialization for `basic_functions[201].handler')
basic_functions.c: In function `php_putenv_destructor':
basic_functions.c:549: warning: implicit declaration of function `unsetenv'
basic_functions.c: In function `php_info_basic':
basic_functions.c:708: warning: implicit declaration of function `php_info_dl'
basic_functions.c: In function `php_if_usleep':
basic_functions.c:940: warning: implicit declaration of function `usleep'
gmake[3]: *** [basic_functions.lo] Error 1
gmake[3]: Leaving directory `/usr/local/work/php-4.0RC1/ext/standard'
gmake[2]: *** [all-recursive] Error 1
gmake[2]: Leaving directory `/usr/local/work/php-4.0RC1/ext/standard'
gmake[1]: *** [all] Error 1
gmake[1]: Leaving directory `/usr/local/work/php-4.0RC1/ext'
gmake: *** [all-recursive] Error 1