PHP 4.0 Bug #4156: Error compiling basic functions

From: Date: Sun, 16 Apr 2000 03:10:32 +0000
Subject: PHP 4.0 Bug #4156: Error compiling basic functions
Groups: php.dev 
Request: Send a blank email to php-dev+get-17939@lists.php.net to get a copy of this message
From: delouw@bigfoot.com Operating system: Suse 6.1 Kernel 2.2.14 PHP version: 4.0 Release Candidate 1 PHP Bug Type: Compile Failure Bug description: Error compiling basic functions Folks, I compiled PHP4rc1 on different machines running SuSE linux 6.3 and 6.4 now I tried on a older box with 6.1 updated with Kernel 2.2.14, and gcc 2.95.2 Here is my config: ./configure \ --with-apxs=/usr/local/apache/bin/apxs \ --enable-versioning --with-mysql=/usr/local/mysql \ --enable-track-vars \ --with-imap=/usr/local/imap-4.7b \ --with-gd Thanks for helping, rgds Luc de Louw /bin/sh ../../libtool --silent --mode=compile gcc -DHAVE_CONFIG_H -I. -I/usr/local/php-4.0RC1/ext/standard -I../.. -I../../Zend -I/usr/local/php-4.0RC1 -I/usr/local/apache/include -I/usr/local/imap-4.7b/c-client -I/usr/local/mysql/include/mysql -I/usr/local/php-4.0RC1/ext/xml/expat/xmltok -I/usr/local/php-4.0RC1/ext/xml/expat/xmlparse -DEAPI=1 -DXML_BYTE_ORDER=12 -D_REENTRANT -g -O2 -Wall -c basic_functions.c basic_functions.c:324: `php_if_dl' undeclared here (not in a function) basic_functions.c:324: initializer element is not constant basic_functions.c:324: (near initialization for `basic_functions[201].handler') basic_functions.c: In function `php_info_basic': basic_functions.c:708: warning: implicit declaration of function `php_info_dl' make[3]: *** [basic_functions.lo] Error 1 make[3]: Leaving directory `/usr/local/php-4.0RC1/ext/standard' make[2]: *** [all-recursive] Error 1 make[2]: Leaving directory `/usr/local/php-4.0RC1/ext/standard' make[1]: *** [all] Error 1 make[1]: Leaving directory `/usr/local/php-4.0RC1/ext' make: *** [all-recursive] Error 1 blah:/usr/local/php-4.0RC1 #

« previous php.dev (#17939) next »