build problem in ext/calendar

From: Date: Mon, 17 Apr 2000 08:05:17 +0000
Subject: build problem in ext/calendar
Groups: php.dev 
Request: Send a blank email to php-dev+get-17962@lists.php.net to get a copy of this message
With freshly checked out cvs : $./cvsclean $./buildconf [...] $./configure --prefix=/usr \ --with-config-file-path=/usr/lib \ --enable-force-cgi-redirect \ --without-pcre-regex \ --enable-debug=no \ --enable-versioning \ --enable-safe-mode \ --with-sybase-ct=/home/sybase \ --with-mysql=/home/lbb/mysql \ --with-gd=/usr/local \ --with-ttf=/usr/lib [...] $make [...] make[3]: *** No rule to make target cal_unix.lo', needed by libcalendar.la'. Stop. make[3]: Leaving directory `/home/lbb/cvs/php4/ext/calendar' make[2]: *** [all-recursive] Error 1 make[2]: Leaving directory `/home/lbb/cvs/php4/ext/calendar' make[1]: *** [all] Error 1 make[1]: Leaving directory `/home/lbb/cvs/php4/ext' make: *** [all-recursive] Error 1 It worked fine on Friday with exactly the same setup. Flavien Lebarbé -- Flavien LEBARBE OPEN CARE Support for Freedom mailto:flebarbe@ocare.com http://www.ocare.com Tel:+33 141430890 Fax:+33 141430891

« previous php.dev (#17962) next »