PHP 4.0 Bug #4228: Apache 1.3.12 fails to compile complaining of missing headers.
| From: | joe at nowalls dot com | Date: | Mon, 24 Apr 2000 20:48:30 +0000 |
| Subject: | PHP 4.0 Bug #4228: Apache 1.3.12 fails to compile complaining of missing headers. | ||
| Groups: | php.dev | ||
| Request: | Send a blank email to php-dev+get-18156@lists.php.net to get a copy of this message | ||
From: joe@nowalls.com
Operating system: Mandrake Linux 7.0
PHP version: 4.0 Release Candidate 1
PHP Bug Type: Compile Failure
Bug description: Apache 1.3.12 fails to compile complaining of missing headers.
After compiling and installing PHP4 RC1 successfully, I then go to compile Apache 1.3.12 and get the
following:
gcc -c -I../../os/unix -I../../include -DLINUX=2 -DUSE_HSREGEX -DUSE_EXPAT -I../../lib/expat-lite
-DNO_DL_NEEDED
../../apaci mod_php4.c
mod_php4.c:24: zend.h: No such file or directory
mod_php4.c:25: php.h: No such file or directory
mod_php4.c:26: php_variables.h: No such file or directory
mod_php4.c:27: SAPI.h: No such file or directory
mod_php4.c:44: php_ini.h: No such file or directory
mod_php4.c:45: php_globals.h: No such file or directory
mod_php4.c:46: SAPI.h: No such file or directory
mod_php4.c:47: main.h: No such file or directory
mod_php4.c:49: zend_compile.h: No such file or directory
mod_php4.c:50: zend_execute.h: No such file or directory
mod_php4.c:51: zend_highlight.h: No such file or directory
mod_php4.c:52: zend_indent.h: No such file or directory
mod_php4.c:54: ext/standard/php_standard.h: No such file or directory
make[4]: *** [mod_php4.o] Error 1
make[3]: *** [all] Error 1
make[2]: *** [subdirs] Error 1
make[2]: Leaving directory `/root/apache_1.3.12/src'
make[1]: *** [build-std] Error 2
make[1]: Leaving directory `/root/apache_1.3.12'
make: *** [build] Error 2
root@nerdnet:~/apache_1.3.12/ >
Apache was configured with:
./configure --with-layout=RedHat --activate-module=src/modules/php4/libmodphp4.a
PHP 4 RC1 was configured with (and sucessfully built):
./configure --with-mysql --with-apache=../apache_1.3.12 --enable-track-vars