PHP 4.0 Bug #4331: Compile bomb in crypt.c

From: Date: Fri, 05 May 2000 05:12:52 +0000
Subject: PHP 4.0 Bug #4331: Compile bomb in crypt.c
Groups: php.dev 
Request: Send a blank email to php-dev+get-18435@lists.php.net to get a copy of this message
From: richard@connections.yk.ca Operating system: Linux (Slackware 7.0) PHP version: 4.0 Release Candidate 1 PHP Bug Type: Compile Failure Bug description: Compile bomb in crypt.c When I tried to compile PHP4.0RC1 I got the following failure. I would prefer to stay with PHP3.0, but I can't find a copy of pdflib2.01 or 2.0 ANYWHERE... Is there ANY possiblity of support for libpdf3.0 with PHP3.0.x?... If not, does anyone know how to solve this compile problem?... Thanks in advance.. Richard W. make[3]: Entering directory `/usr/src/php-4.0RC1/ext/standard' gcc -DHAVE_CONFIG_H -I. -I/usr/src/php-4.0RC1/ext/standard -I../.. -I../../Zend -I/usr/src/php-4.0RC1 -I/usr/src/apache_1.3.12/src/include -I/usr/src/apache_1.3.12/src/os/unix -I/usr/src/php-4.0RC1/ext/mysql/libmysql -I/usr/local/pgsql/include -I/usr/src/php-4.0RC1/ext/xml/expat/xmltok -I/usr/src/php-4.0RC1/ext/xml/expat/xmlparse -DXML_BYTE_ORDER=12 -D_REENTRANT -g -O2 -Wall -c crypt.c && touch crypt.lo crypt.c: In function `php_if_crypt': crypt.c:110: `PHP_MAX_SALT_LEN' undeclared (first use in this function) crypt.c:110: (Each undeclared identifier is reported only once crypt.c:110: for each function it appears in.) crypt.c:110: size of array `salt' has non-integer type crypt.c: At top level: crypt.c:101: warning: `php_to64' defined but not used make[3]: *** [crypt.lo] Error 1 make[3]: Leaving directory `/usr/src/php-4.0RC1/ext/standard' make[2]: *** [all-recursive] Error 1 make[2]: Leaving directory `/usr/src/php-4.0RC1/ext/standard' make[1]: *** [all] Error 1 make[1]: Leaving directory `/usr/src/php-4.0RC1/ext' make: *** [all-recursive] Error 1 nile:/usr/src/php-4.0RC1#

« previous php.dev (#18435) next »