bug #4372

From: Date: Sat, 27 May 2000 17:21:50 +0000
Subject: bug #4372
Groups: php.dev 
Request: Send a blank email to php-dev+get-19590@lists.php.net to get a copy of this message
I see that I have exactly the same prob as the bug #4372 but he didn't provide any info.. here's some info.. system: redhat 6.0 apache 1.3.12 trying php-4.0.0 # ./configure --quiet --with-apxs=/sbin/apxs --with-config-file-path=/etc --di sable-debug --enable-track-vars --with-gd=/usr/local --with-jpeg-dir=/usr/lo cal --with-mysql when I use --with-mysql=/usr/local it compiles fine then apache says: # apachectl configtest Syntax error on line 208 of /usr/local/apache/conf/httpd.conf: Cannot load /usr/local/apache/libexec/libphp4.so into server: libmysqlclient.so.6: cannot open shared object file: No such file or directory so when I compile anyways, here's what shows: # make >/dev/null In file included from libmysql.c:11: global.h:194: warning: redefinition of `uint' /usr/include/sys/types.h:130: warning: `uint' previously declared here global.h:195: warning: redefinition of `ushort' /usr/include/sys/types.h:129: warning: `ushort' previously declared here In file included from libmysql.c:14: m_string.h:165: parse error before `__extension__' m_string.h:165: parse error before `&&' make[4]: *** [libmysql.lo] Error 1 make[3]: *** [all-recursive] Error 1 make[2]: *** [all-recursive] Error 1 make[1]: *** [all-recursive] Error 1 make: *** [all-recursive] Error 1 hope this helps quash the bug.. -=-=-=-=-=-=-=-=-=-=-=-=-=-=-=-=-=-=-=-=-=- Theodore Baschak - Gecko Internet Services http://www.gecko-internet.com -=-=-=-=-=-=-=-=-=-=-=-=-=-=-=-=-=-=-=-=-=-

« previous php.dev (#19590) next »