PHP 4.0 Bug #5020: snapshot php4-200006131345 failed to compile

From: Date: Wed, 14 Jun 2000 00:20:01 +0000
Subject: PHP 4.0 Bug #5020: snapshot php4-200006131345 failed to compile
Groups: php.dev 
Request: Send a blank email to php-dev+get-21277@lists.php.net to get a copy of this message
From: waldschrott@kiffen.de Operating system: win32(2000) PHP version: 4.0.0 Release PHP Bug Type: Compile Failure Bug description: snapshot php4-200006131345 failed to compile debug info: Bibliothek Release_TS/php4ts.lib und Objekt Release_TS/php4ts.exp wird erstellt basic_functions.obj : error LNK2001: Nichtaufgeloestes externes Symbol _is_numeric_string ZendTS.lib(zend_operators.obj) : error LNK2001: Nichtaufgeloestes externes Symbol _is_numeric_string ZendTS.lib(zend_execute_API.obj) : error LNK2001: Nichtaufgeloestes externes Symbol _safe_free_zval_ptr ZendTS.lib(zend_execute.obj) : error LNK2001: Nichtaufgeloestes externes Symbol _safe_free_zval_ptr ZendTS.lib(zend_execute_API.obj) : error LNK2001: Nichtaufgeloestes externes Symbol _i_zend_is_true ZendTS.lib(zend_execute.obj) : error LNK2001: Nichtaufgeloestes externes Symbol _i_zend_is_true ZendTS.lib(zend_execute_API.obj) : error LNK2001: Nichtaufgeloestes externes Symbol _zend_ptr_stack_clear_multiple ZendTS.lib(zend_execute.obj) : error LNK2001: Nichtaufgeloestes externes Symbol _zend_ptr_stack_clear_multiple ZendTS.lib(zend_execute_API.obj) : error LNK2001: Nichtaufgeloestes externes Symbol _zend_assign_to_variable_reference ZendTS.lib(zend_execute.obj) : error LNK2001: Nichtaufgeloestes externes Symbol _zend_assign_to_variable_reference ZendTS.lib(zend_execute.obj) : error LNK2001: Nichtaufgeloestes externes Symbol _zend_ptr_stack_get_arg Release_TS/php4ts.dll : fatal error LNK1120: 6 unaufgeloeste externe Verweise Fehler beim Ausführen von link.exe. php.exe - 12 Fehler, 9 Warnung(en)

« previous php.dev (#21277) next »