PHP 4.0 Bug #5345: main.c:370: incompatible types in assignment

From: Date: Mon, 03 Jul 2000 17:03:06 +0000
Subject: PHP 4.0 Bug #5345: main.c:370: incompatible types in assignment
Groups: php.dev 
Request: Send a blank email to php-dev+get-23228@lists.php.net to get a copy of this message
From: tomas.karlsson@anatomy.umu.se Operating system: LinuxPPC 2000 (RH 6.2 based) PHP version: 4.0.1pl2 PHP Bug Type: Compile Failure Bug description: main.c:370: incompatible types in assignment Expreinecd on two machines; on erlier versions of php been-able to compile but they have not been vorking, even crashed Apache. Dont know what to do. Enviroment Apache 1.3.12, mod_ssl, mod_perl, MySQL 3.22.32 - all complied and runs nicly on these macines: Confiure options for php --with-mysql=/usr/local --with-apxs. Configure scripts returns no errors. /bin/sh ../libtool --silent --mode=compile gcc -DHAVE_CONFIG_H -I. -I. -I.. -DXML_BYTE_ORDER=21 -g -O2 -c zend_sprintf.c /bin/sh ../libtool --silent --mode=link gcc -g -O2 -o libZend.la -lgdbm -lpam -ldl -lttf -lgd -lresolv -lm -ldl -lcrypt -lnsl -lresolv zend-parser.lo zend_alloc.lo zend_compile.lo zend_constants.lo zend_dynamic_array.lo zend_execute.lo zend_execute_API.lo zend_highlight.lo zend_llist.lo zend_opcode.lo zend_operators.lo zend_ptr_stack.lo zend_stack.lo zend_variables.lo zend.lo zend_API.lo zend_extensions.lo zend_hash.lo zend_list.lo zend_indent.lo zend_builtin_functions.lo zend_sprintf.lo libZend_c.la libZend_gcc.la make[1]: Leaving directory `/home/root/php-4.0.1/Zend' Making all in main make[1]: Entering directory `/home/root/php-4.0.1/main' make[2]: Entering directory `/home/root/php-4.0.1/main' gcc -DHAVE_CONFIG_H -I. -I/home/root/php-4.0.1/main -I/home/root/php-4.0.1 -I/home/root/php-4.0.1/main -I/home/root/apache_1.3.12/src/include -I/home/root/apache_1.3.12/src/os/unix -I/home/root/php-4.0.1/Zend -I/home/root/php-4.0.1 -I/home/root/php-4.0.1/ext/mysql/libmysql -I/home/root/php-4.0.1/ext/xml/expat/xmltok -I/home/root/php-4.0.1/ext/xml/expat/xmlparse -DXML_BYTE_ORDER=21 -g -O2 -c main.c && touch main.lo main.c: In function `php_error_cb': main.c:370: incompatible types in assignment main.c:435: incompatible types in assignment make[2]: *** [main.lo] Error 1 make[2]: Leaving directory `/home/root/php-4.0.1/main' make[1]: *** [all-recursive] Error 1 make[1]: Leaving directory `/home/root/php-4.0.1/main' make: *** [all-recursive] Error 1 [root@imb php-4.0.1]#

« previous php.dev (#23228) next »